program: Gaussian 09
title: 000218853
version: EM64L-G09RevD.01
frameworkgroup: C1[X(C13H18Br2N2OS)]
method: RPBEPBE
basis: SDD
operation: Freq
keyword: #p
keyword: freq=noraman
keyword: PBEPBE/SDD
title: #p freq=noraman PBEPBE/SDD
converged: YES YES NO NO
title: Mulliken charges:
elementType: Br Br S O N N C C C C C C C C C C C C C H H H H H H H H H H H H H H H H H H
charge: 0.041993 0.028062 0.111906 -0.252535 -0.030620 -0.048321 -0.333562 -0.371565 -0.372303 -0.355186 -0.661292 -0.703804 -0.409595 -0.285713 0.279148 -0.327805 -0.031484 -0.307427 -0.164100 0.210981 0.211368 0.215558 0.185826 0.233132 0.241292 0.189241 0.227254 0.282485 0.250703 0.262395 0.258552 0.221115 0.198688 0.226038 0.236339 0.279720 0.263515
chargesum: 0.00000
title: Mulliken charges with hydrogens summed into heavy atoms:
elementType: Br Br S O N N C C C C C C C C C C C C C
charge: 0.041993 0.028062 0.111906 -0.252535 -0.030620 -0.048321 0.088786 0.029818 0.102121 0.061309 -0.128104 -0.182858 0.010208 0.176665 0.279148 -0.327805 0.248236 -0.043911 -0.164100
polarizability: 2.88651028e+02 1.36384154e+01 2.02442805e+02 -2.29087845e+01 3.97718803e+00 1.40984149e+02
1716.lowfreq: -19.9680 -6.3546 -3.7108 -1.3670 -0.0021 -0.0006 0.0003 8.3748 14.3333
frequency: -17.2352 8.3264 14.2049 38.1636 58.1827 70.2404 87.4816 91.1354 111.4365 115.6579 133.3726 142.9769 148.6924 161.3990 212.3410 242.9401 262.4055 291.2275 315.9234 337.7962 346.6886 405.0909 426.0736 448.4449 463.4153 488.0665 504.2919 525.4180 548.0427 620.0158 631.5687 664.5010 680.2305 734.0040 734.6511 766.1876 801.6395 819.4851 866.1885 886.9492 891.7047 894.8759 906.5556 907.7565 908.3583 940.1028 991.4219 993.4579 1012.2064 1036.1391 1061.5754 1075.0714 1088.5205 1094.8666 1101.9111 1121.2364 1141.2556 1157.1085 1197.3770 1211.8393 1219.7855 1236.5332 1248.3233 1250.2191 1266.5193 1277.6343 1288.9795 1303.0719 1306.7172 1315.5175 1326.4408 1334.3177 1342.1936 1359.9056 1367.4428 1373.8184 1422.3951 1449.5677 1451.6584 1454.8744 1463.8440 1469.6554 1471.3326 1475.0334 1484.8562 1513.4118 1550.0299 2907.7646 2965.9609 2973.9130 2980.2697 3003.6940 3007.0507 3017.2362 3024.9432 3032.2997 3041.0590 3057.8645 3058.3918 3073.6049 3079.5307 3109.1208 3147.6703 3162.2953 3181.3838
redmass: 4.5408 12.8109 8.1697 5.9215 4.6877 3.0374 3.2504 4.0912 2.8524 13.4872 5.8510 2.4505 5.2703 3.4307 3.3781 3.2811 6.1225 4.4757 3.1909 8.5406 4.0503 3.2323 2.8239 4.7305 3.6878 3.4742 5.5211 4.3356 3.6792 9.0165 4.8921 2.9861 4.5510 2.5775 1.7673 1.6618 2.6821 2.2418 1.7392 1.7147 1.4304 2.8409 1.3670 1.6873 3.3680 1.8768 2.7986 3.2279 2.0926 2.1638 2.8541 2.1602 2.2773 2.1662 1.9779 1.4710 1.6419 1.2647 1.2486 1.2917 1.6730 1.5264 1.2492 1.2695 3.4966 1.2869 1.0904 1.1922 1.4271 3.5094 1.3495 1.4340 2.2423 1.8068 1.6675 1.4043 2.4610 1.0854 1.0873 1.0811 1.0824 1.0829 1.1153 1.1040 1.0973 8.8315 7.3515 1.0681 1.0619 1.0616 1.0619 1.0594 1.0610 1.0903 1.0937 1.0580 1.1004 1.0759 1.0845 1.1076 1.1027 1.1095 1.1112 1.0933 1.0939
irintensity: 0.9348 0.0652 0.0893 0.5637 0.7364 0.7724 0.0443 0.3862 2.1780 0.2488 3.4562 1.4595 2.3806 1.0166 2.7557 3.0406 1.8729 1.9418 1.3053 0.0524 3.8657 6.8646 24.4642 0.7129 8.4576 0.4721 8.1195 15.3527 5.6674 8.6461 50.4776 13.6765 68.7478 10.1809 22.2201 15.4475 11.0078 12.0043 1.2278 6.9535 25.9917 11.1204 1.4806 10.7497 14.5249 25.6588 48.2677 55.3321 22.5355 72.0577 0.8072 16.7689 22.9132 23.8027 8.0255 8.3803 1.1874 9.5369 7.3406 31.9073 8.9343 3.7128 3.3677 10.6521 271.3971 5.4940 7.5075 14.0370 15.2298 24.9430 1.1233 13.2013 144.6965 5.4034 0.1242 1.3912 370.5639 8.3999 8.3025 7.3043 4.6914 0.7358 0.8679 3.7627 15.2800 11.1124 57.8696 37.5241 10.0343 17.2628 48.9460 22.1106 37.3254 11.9910 6.2527 34.1029 1.2449 34.9027 76.8229 42.8554 20.1301 28.6401 12.6868 7.5830 0.1127
temp: 298.150 k
press: 1.00000 atm
elementType: 35 35 16 8 7 7 6 6 6 6 6 6 6 6 6 6 6 6 6 1 1 1 1 1 1 1 1 1 1 1 1 1 1 1 1 1 1
symmnumber: 1
zpe: 764332.0 jmol-1
zpe.correction: 0.291119 hartree
zpe.thermalcorrener: 0.310851 hartree
zpe.thermalcorrenthalpy: 0.311795 hartree
zpe.thermalcorrgfe: 0.237249 hartree
zpe.sumelectzpe: -1114.404888 hartree
zpe.sumelectthermal: -1114.385156 hartree
zpe.sumelectthermalent: -1114.384212 hartree
zpe.sumelectthermalfe: -1114.458758 hartree
dipole: -0.7062 0.5056 -0.8679
dipole: 1.2278
quadrupole: -160.3324 -134.4739 -142.3536
quadrupole: 11.1926 -7.5342 7.7210
quadrupole: -14.6124 11.2461 3.3663 11.1926 -7.5342 7.7210
hfenergy: -1114.696007 hartree
pointgroup: C01 [X(C13H18Br2N2O1S1)]
dipole: 0.2831093 -0.1068593 -0.3765412 debye
polarizability: 287.462632|1.0948149|199.061629|30.6720624|12.2918357|145.5537211 unknown
InChI: InChI=1S/C13H18Br2N2OS/c14-11-8-12(15)13(16-9-11)18-6-3-1-2-4-17-5-7-19-10-17/h8-9H,1-7,10H2
charge 0 multiplicity 1
37 atoms
Br 2.458569 -2.617625 -0.900745
Br 7.358598 -0.489877 1.443416
S  -6.677383 0.590512 1.545458
O  1.645784 0.364594 -0.522725
N  -5.00493 -0.327934 -0.472938
N  3.639196 1.213327 0.427811
C  -3.638054 -0.215847 0.11558
C  -2.711607 0.691105 -0.718417
C  -5.770516 -1.514996 -0.023528
C  -1.286104 0.76279 -0.127551
C  -5.853619 0.818343 -0.260031
C  -6.306754 -1.267304 1.429533
C  -0.348625 1.66877 -0.956198
C  1.076769 1.742718 -0.409153
C  2.931533 0.172237 -0.079228
C  3.492873 -1.136633 -0.169561
C  4.806676 -1.348498 0.278332
C  4.915101 1.018643 0.865076
C  5.526327 -0.247427 0.804496
H  -3.685399 0.157198 1.165817
H  -3.206816 -1.234188 0.144343
H  -2.676484 0.30115 -1.754075
H  -3.136231 1.713973 -0.778446
H  -6.630477 -1.65337 -0.704573
H  -5.137492 -2.417124 -0.074746
H  -1.333241 1.139516 0.915811
H  -0.849679 -0.253352 -0.079389
H  -6.699111 0.838549 -0.962847
H  -5.304895 1.769436 -0.26178
H  -7.233751 -1.830983 1.619019
H  -5.55296 -1.521746 2.192435
H  -0.313838 1.314073 -2.004504
H  -0.750262 2.702681 -0.980419
H  1.108114 2.047178 0.653491
H  1.717675 2.431697 -0.988469
H  5.258929 -2.341588 0.221072
H  5.440383 1.891099 1.264233
