program: Gaussian 09
title: 000218839
version: EM64L-G09RevD.01
frameworkgroup: C1[X(C10H13ClN2OS)]
method: RPBEPBE
basis: SDD
operation: Freq
keyword: #p
keyword: freq=noraman
keyword: PBEPBE/SDD
title: #p freq=noraman PBEPBE/SDD
converged: YES YES NO NO
title: Mulliken charges:
elementType: Cl S O N N C C C C C C C C C C H H H H H H H H H H H H H
charge: -0.052360 0.128224 -0.262954 -0.038321 -0.047971 -0.376619 -0.348300 -0.661086 -0.698354 -0.269414 0.185185 -0.308865 -0.089152 -0.342756 -0.068845 0.236954 0.244623 0.231085 0.224063 0.287180 0.252666 0.259083 0.264753 0.238541 0.221682 0.260630 0.265918 0.264414
chargesum: 0.00000
title: Mulliken charges with hydrogens summed into heavy atoms:
elementType: Cl S O N N C C C C C C C C C C
charge: -0.052360 0.128224 -0.262954 -0.038321 -0.047971 0.104958 0.106848 -0.121240 -0.174518 0.190808 0.185185 -0.048236 0.176766 -0.078342 -0.068845
polarizability: 2.26147404e+02 1.39357106e+01 1.29282370e+02 1.62365346e+00 -4.59756907e+00 1.00812144e+02
1716.lowfreq: -15.3290 -2.9246 -0.0012 0.0015 0.0025 6.0193 15.7188 31.1465 50.2416
frequency: 15.3443 30.8501 50.2142 62.3106 105.3016 122.7812 141.8273 155.5532 203.1010 233.8905 292.3902 310.7637 370.8614 399.1384 422.7847 431.0601 464.7982 494.5629 505.5006 528.8921 616.0830 634.6772 659.8489 664.9426 736.6828 791.5553 807.1129 825.5481 838.2433 883.1733 906.2580 907.4065 912.5742 958.2207 958.9348 968.3145 997.7183 1037.4408 1069.8340 1084.9646 1092.8804 1112.2277 1122.5855 1142.7339 1168.6071 1216.2810 1241.9116 1251.8517 1255.8631 1279.5693 1287.4250 1308.5218 1320.3472 1329.3228 1334.7401 1353.9676 1388.2445 1441.7170 1454.5129 1456.4504 1466.2468 1477.7934 1485.4635 1548.4427 1576.4849 2947.7678 3011.4933 3013.5850 3033.7331 3054.9152 3058.2194 3083.4282 3088.9346 3111.2667 3145.0852 3157.1694 3166.4596 3187.2088
redmass: 7.7891 4.9500 5.1315 7.3223 4.9401 3.2042 2.2458 3.9429 6.5596 4.2656 4.3189 6.6954 4.2790 3.1420 3.8296 3.3311 4.0042 4.8777 2.8898 4.9093 7.8611 5.6135 8.2075 3.0286 4.8804 3.9640 1.1438 1.5015 3.0525 1.8191 1.3984 1.6688 3.3117 1.3299 8.3198 4.8097 1.5672 2.1746 1.7518 2.5992 2.2818 1.5079 1.2943 1.4609 1.1524 1.1868 1.4740 1.3254 2.4591 1.7372 1.2007 1.5152 1.5224 5.6103 1.3863 2.4176 1.5380 2.2388 1.1080 1.0834 1.0901 1.1007 1.0881 7.5597 6.5102 1.0673 1.0611 1.0582 1.0580 1.0933 1.0585 1.1035 1.1068 1.1094 1.1124 1.0930 1.0898 1.0984
irintensity: 0.3452 0.7993 0.2970 0.4608 0.4894 1.3241 2.7458 7.1008 0.4851 5.7634 10.9780 2.3444 10.1901 3.1120 2.3149 23.7522 8.3026 1.5863 10.0429 18.2759 8.1576 60.1454 50.5936 6.1781 1.1519 6.7791 0.9140 52.8677 2.8679 6.9272 8.0259 6.1406 15.8692 0.0057 78.9950 35.3985 20.6372 63.3699 31.1903 44.1477 4.0063 19.4538 11.2341 4.6611 3.8304 55.6562 9.7677 17.8403 258.7854 18.6244 10.2623 22.9576 7.9354 33.7472 8.2877 69.0975 6.5046 296.0934 21.1356 12.9994 3.8650 1.6155 5.0932 7.0812 77.5129 27.3741 39.0243 18.7659 35.8962 7.7394 21.5140 7.4969 40.1561 26.1946 13.3573 8.9751 1.3010 2.0921
temp: 298.150 k
press: 1.00000 atm
elementType: 17 16 8 7 7 6 6 6 6 6 6 6 6 6 6 1 1 1 1 1 1 1 1 1 1 1 1 1
symmnumber: 1
zpe: 572861.2 jmol-1
zpe.correction: 0.218191 hartree
zpe.thermalcorrener: 0.232888 hartree
zpe.thermalcorrenthalpy: 0.233832 hartree
zpe.thermalcorrgfe: 0.173184 hartree
zpe.sumelectzpe: -1430.548865 hartree
zpe.sumelectthermal: -1430.534169 hartree
zpe.sumelectthermalent: -1430.533225 hartree
zpe.sumelectthermalfe: -1430.593873 hartree
dipole: 0.4099 1.5528 1.6967
dipole: 2.3363
quadrupole: -112.7575 -97.2943 -106.4634
quadrupole: -1.6488 13.1154 0.4777
quadrupole: -7.2524 8.2108 -0.9583 -1.6488 13.1154 0.4777
hfenergy: -1430.7670565 hartree
pointgroup: C01 [X(C10H13Cl1N2O1S1)]
dipole: -0.1862752 0.7406922 -0.5113972 debye
polarizability: 225.9327348|-13.0569027|125.8602914|-6.6083962|10.7548123|104.4488922 unknown
InChI: InChI=1S/C10H13ClN2OS/c11-9-1-2-10(12-7-9)14-5-3-13-4-6-15-8-13/h1-2,7H,3-6,8H2
charge 0 multiplicity 1
28 atoms
Cl 6.0736 -0.551246 -0.085354
S  -4.852046 -0.598059 1.573101
O  0.318109 0.907067 0.273563
N  -3.114797 -0.292009 -0.566831
N  2.003851 -0.607018 -0.41631
C  -4.358571 0.409994 -0.964767
C  -2.03896 0.594912 -0.044041
C  -3.500901 -1.361199 0.326949
C  -5.164621 0.794864 0.322238
C  -0.667231 -0.031212 -0.322157
C  1.656088 0.557316 0.18719
C  2.595546 1.465155 0.748778
C  3.958507 1.133227 0.670752
C  3.329939 -0.925119 -0.488915
C  4.321005 -0.080888 0.040859
H  -4.966047 -0.281581 -1.576761
H  -4.118582 1.295763 -1.576736
H  -2.151061 0.787483 1.045426
H  -2.097068 1.566981 -0.56417
H  -4.014455 -2.173484 -0.207159
H  -2.664684 -1.741215 0.929823
H  -4.809515 1.742773 0.758419
H  -6.244949 0.858938 0.118067
H  -0.478153 -0.135238 -1.404583
H  -0.552237 -1.026754 0.143968
H  2.250444 2.386969 1.222713
H  4.722327 1.796393 1.086314
H  3.58816 -1.868913 -0.979177
