program: Gaussian 09
title: 000218809
version: EM64L-G09RevD.01
frameworkgroup: C1[X(C13H22N2OS)]
method: RPBEPBE
basis: SDD
operation: Freq
keyword: #p
keyword: freq=noraman
keyword: PBEPBE/SDD
title: #p freq=noraman PBEPBE/SDD
converged: YES YES NO NO
title: Mulliken charges:
elementType: S O N N C C C C C C C C C C C C C H H H H H H H H H H H H H H H H H H H H H H
charge: -0.030280 -0.267510 -0.284694 -0.055217 -0.361590 -0.390011 -0.394663 -0.375571 -0.280229 -0.287753 -0.705498 0.168207 -0.494335 0.475037 -0.325131 -0.325911 -0.794016 0.189706 0.191587 0.220606 0.182160 0.208530 0.211998 0.179261 0.212996 0.218936 0.220131 0.241211 0.229222 0.183105 0.282858 0.246511 0.256808 0.229210 0.090322 0.233948 0.230267 0.234652 0.235140
chargesum: 0.00000
title: Mulliken charges with hydrogens summed into heavy atoms:
elementType: S O N N C C C C C C C C C C C C C
charge: 0.060041 -0.267510 -0.043483 -0.055217 0.019703 0.012755 0.025865 0.016686 0.158838 0.124575 -0.176130 0.168207 -0.237526 0.475037 -0.095921 -0.091963 -0.093958
polarizability: 2.68226779e+02 5.99264021e+00 1.56620183e+02 1.20954108e+00 1.80788068e+00 1.13905943e+02
1716.lowfreq: -4.0861 -1.9340 -0.0015 -0.0014 -0.0011 8.1920 13.9616 21.3066 35.4584
frequency: 12.2425 21.1907 34.4246 36.5455 50.6077 67.7646 75.0661 87.0682 120.5883 122.6839 131.2771 145.7505 148.6770 172.0022 204.4201 216.3452 223.4290 234.0600 279.3658 337.4444 356.4530 440.5669 447.0567 460.9939 506.0269 514.3072 584.2305 635.5248 674.6199 689.2103 737.7474 738.9817 747.2048 759.8627 772.4944 824.6933 836.9329 845.5574 878.8903 887.9661 952.8103 956.5212 957.8898 969.0550 999.2197 1009.9678 1021.8385 1043.2332 1047.8804 1061.2977 1071.8741 1083.4411 1101.8912 1112.2657 1125.6785 1142.8042 1153.8736 1160.9127 1204.1123 1231.8228 1237.1091 1257.0884 1267.8431 1274.2124 1277.4691 1286.7482 1290.2059 1290.5559 1298.8193 1331.2030 1337.1735 1353.0813 1365.1429 1388.7057 1398.0632 1410.6260 1447.5116 1452.6502 1454.7585 1466.8452 1468.4007 1468.9159 1470.4654 1476.6436 1482.4945 1489.6693 1497.0182 1551.1074 1602.7188 2430.0500 2848.2727 2857.5231 2958.0140 2964.3926 2981.9628 2989.5561 2997.3114 2998.6789 3004.0709 3023.6027 3035.2974 3036.5909 3047.5702 3061.9534 3072.2460 3093.2812 3113.7537 3128.6269 3156.0170 3165.1933 3425.7515
redmass: 5.4868 5.2572 3.1467 2.6189 1.0540 4.7626 4.1301 1.6675 2.1969 2.8537 4.2658 3.4823 2.2320 2.7928 1.1890 4.3306 4.0810 3.4341 4.2546 3.7384 3.4586 4.6832 2.8381 3.3128 5.5724 3.9544 3.8864 6.9081 1.5099 2.3286 2.5312 1.2314 1.2369 6.3447 1.1110 1.3029 1.1514 1.1977 5.4706 1.3724 6.2564 1.3786 1.2644 2.3792 2.9422 2.9621 2.4040 2.3262 1.5673 2.9201 2.0814 2.2628 1.9528 2.0881 1.2942 3.9682 1.2840 1.8885 1.4439 1.2821 1.2448 1.2794 1.1482 2.6706 1.1726 1.1131 1.3682 1.2060 1.2931 1.8495 2.6017 1.5388 1.7520 1.4614 1.2325 2.7336 1.1133 2.2440 1.1761 1.0871 1.0455 1.0714 1.1322 1.1004 1.0915 1.0944 1.0896 6.0239 5.9239 1.0382 1.0715 1.0713 1.0610 1.0631 1.0373 1.0601 1.0659 1.0751 1.0976 1.0706 1.0776 1.1015 1.1038 1.0974 1.1071 1.0990 1.1042 1.0876 1.0972 1.0935 1.0740
irintensity: 0.1403 0.2660 2.1850 2.6914 0.4851 0.8909 0.8633 1.7971 0.1718 3.9100 0.8536 0.7763 0.9878 4.2246 20.0604 0.1126 1.3977 17.5094 1.3281 1.9603 1.4820 1.8638 11.5029 7.6042 1.6175 0.0211 4.1474 9.8363 88.3249 27.3021 4.4832 6.9939 2.2819 13.4425 0.0662 47.7368 5.7165 1.2826 2.1539 7.8154 18.4637 0.5503 1.6250 34.2067 6.5185 6.0653 71.0883 9.7302 13.7378 31.7327 16.1168 1.8917 1.5009 10.9284 15.2927 79.8173 1.7738 117.0912 1.3134 0.1390 5.2689 3.7356 9.7328 112.7927 2.8135 0.3165 4.9039 0.6941 0.0167 131.4041 24.8572 5.1295 44.1023 0.9909 16.4415 60.3312 14.6795 24.1463 26.4175 18.8932 14.0394 5.7518 57.4918 11.8983 3.0982 4.8179 9.8029 60.5803 197.5581 32.4105 55.6343 155.2085 2.1095 43.3303 26.0017 8.1053 18.1519 69.6334 4.9935 9.0081 35.4859 12.3205 36.2070 17.0438 94.8037 19.4300 13.9834 10.4745 33.5483 1.4478 1.4424
temp: 298.150 k
press: 1.00000 atm
elementType: 16 8 7 7 6 6 6 6 6 6 6 6 6 6 6 6 6 1 1 1 1 1 1 1 1 1 1 1 1 1 1 1 1 1 1 1 1 1 1
symmnumber: 1
zpe: 862816.3 jmol-1
zpe.correction: 0.328629 hartree
zpe.thermalcorrener: 0.348842 hartree
zpe.thermalcorrenthalpy: 0.349786 hartree
zpe.thermalcorrgfe: 0.275177 hartree
zpe.sumelectzpe: -1090.009670 hartree
zpe.sumelectthermal: -1089.989457 hartree
zpe.sumelectthermalent: -1089.988513 hartree
zpe.sumelectthermalfe: -1090.063123 hartree
dipole: -3.0442 -0.2942 1.8699
dipole: 3.5847
quadrupole: -114.1169 -110.4372 -111.3226
quadrupole: 3.1152 13.9633 -0.6008
quadrupole: -2.1580 1.5217 0.6363 3.1152 13.9633 -0.6008
hfenergy: -1090.3382992 hartree
pointgroup: C01 [X(C13H22N2O1S1)]
dipole: -1.1947196 -0.1286957 0.7382954 debye
polarizability: 268.1557004|6.6695182|156.6670057|0.7856237|2.1233336|113.9301995 unknown
InChI: InChI=1S/C13H22N2OS/c1-12-5-7-15-13(11-12)16-9-4-2-3-6-14-8-10-17/h5,7,11,14,17H,2-4,6,8-10H2,1H3
charge 0 multiplicity 1
39 atoms
S  9.452816 0.260892 -0.266756
O  -2.139062 -0.618316 0.026446
N  5.338209 -0.420062 0.113104
N  -3.559332 1.279012 0.003042
C  1.546673 0.370505 0.08048
C  2.8483 -0.461393 0.08508
C  0.27747 -0.512544 0.059901
C  4.115623 0.414902 0.109686
C  -0.996696 0.333349 0.045671
C  6.61298 0.326909 0.106767
C  7.780843 -0.630798 -0.179717
C  -3.41492 -0.069327 0.003289
C  -4.501589 -0.985531 -0.019428
C  -5.815625 -0.478885 -0.043929
C  -5.980058 0.938912 -0.044356
C  -4.840406 1.761489 -0.020873
C  -7.019659 -1.399945 -0.069998
H  1.525621 1.029455 0.973504
H  1.545111 1.041928 -0.80326
H  2.887116 -1.114351 -0.808034
H  2.84777 -1.133542 0.969789
H  0.263821 -1.17537 0.946745
H  0.288494 -1.16845 -0.831792
H  4.063806 1.111553 0.985735
H  4.141196 1.050137 -0.798179
H  -1.081043 0.978109 0.940659
H  -1.056045 0.984524 -0.846548
H  5.30969 -1.120095 0.868454
H  6.567246 1.08455 -0.697709
H  6.80867 0.884108 1.058654
H  7.656515 -1.099488 -1.168592
H  7.851953 -1.428987 0.579831
H  -4.296675 -2.059775 -0.017947
H  -6.97938 1.386009 -0.062899
H  9.453117 0.702488 1.047759
H  -4.934933 2.853343 -0.020665
H  -6.720693 -2.461476 -0.058444
H  -7.674879 -1.219726 0.802524
H  -7.630447 -1.227009 -0.975696
