program: Gaussian 09
title: 000218803
version: EM64L-G09RevD.01
frameworkgroup: C1[X(C12H19IN2OS)]
method: RPBEPBE
basis: SDD
operation: Freq
keyword: #p
keyword: freq=noraman
keyword: PBEPBE/SDD
title: #p freq=noraman PBEPBE/SDD
converged: YES YES NO NO
title: Mulliken charges:
elementType: I S O N N C C C C C C C C C C C C H H H H H H H H H H H H H H H H H H H
charge: 0.107658 -0.029038 -0.258591 -0.285082 -0.050195 -0.361161 -0.390090 -0.394845 -0.374983 -0.285980 -0.288106 -0.705749 0.173508 -0.315340 -0.072745 -0.284836 -0.287933 0.190814 0.192324 0.221140 0.183205 0.214048 0.211044 0.179463 0.212919 0.222725 0.224207 0.241529 0.183771 0.229398 0.246740 0.282907 0.261449 0.090536 0.258889 0.256401
chargesum: 0.00000
title: Mulliken charges with hydrogens summed into heavy atoms:
elementType: I S O N N C C C C C C C C C C C C
charge: 0.107658 0.061497 -0.258591 -0.043553 -0.050195 0.021977 0.014255 0.030247 0.017399 0.160952 0.125063 -0.176102 0.173508 -0.053891 0.186144 -0.028435 -0.287933
polarizability: 3.18662473e+02 -8.84984562e+00 1.56153941e+02 -1.59010187e+00 -4.06054056e+00 1.07139852e+02
1716.lowfreq: -4.9669 -1.4353 0.0007 0.0017 0.0017 9.2450 11.3521 17.8415 25.9526
frequency: 11.1238 17.3149 25.8853 38.2714 57.2127 64.3729 80.8458 98.7545 106.1550 120.5824 132.1864 136.0595 159.2378 169.4604 192.0240 208.2091 227.6796 260.8989 291.1638 324.6153 357.2393 416.6038 448.8640 459.2857 507.1275 517.4376 615.5104 639.4197 671.1487 689.6518 735.5623 737.7328 747.4861 771.8203 812.7088 828.7383 836.8916 844.2090 912.5396 944.2639 956.1941 956.7712 965.6683 999.6598 1013.3336 1043.4036 1061.0821 1064.2946 1071.9773 1083.3689 1108.2654 1125.9580 1127.9576 1143.1375 1154.7083 1204.1780 1233.3453 1237.1150 1254.1715 1258.8258 1269.9665 1279.4137 1285.0940 1287.8021 1290.9025 1300.2946 1320.8317 1333.7298 1343.1613 1358.6472 1376.6368 1390.2398 1436.8174 1448.0309 1454.9423 1466.4204 1468.5102 1474.3076 1482.7896 1488.2807 1496.3162 1535.1012 1568.4473 2434.5076 2846.9892 2858.7429 2957.2200 2963.5328 2990.1215 2997.0673 2998.5441 3002.7726 3024.4630 3036.5391 3037.0771 3047.7715 3073.4556 3113.5241 3151.4635 3161.5602 3184.1578 3426.2260
redmass: 4.8885 7.2599 4.0399 2.4291 5.9114 4.5887 1.7137 4.0289 6.2983 1.9743 3.8916 3.0442 2.9366 2.8518 2.9750 1.3616 5.8963 5.2728 6.7520 5.1993 4.1685 3.7132 4.8873 3.4251 2.9398 3.9729 7.9771 7.8492 1.4483 2.5194 4.8991 1.0708 1.2364 1.1120 7.0943 1.4995 1.1574 1.1941 1.3932 8.4414 3.5169 1.4621 1.3291 2.9584 4.1170 2.3344 2.8814 2.4521 2.0936 2.2841 2.9083 1.2800 1.3832 3.9636 1.2781 1.4341 1.2788 1.2467 2.1477 1.5160 1.1399 1.1298 1.7613 1.1000 1.1150 1.2792 5.9939 1.5621 1.8338 1.5695 1.6414 1.4539 2.1470 1.1221 1.1683 1.0882 1.0687 1.0954 1.0926 1.0954 1.0884 7.2333 6.4334 1.0383 1.0714 1.0714 1.0606 1.0636 1.0602 1.0788 1.0624 1.0977 1.0693 1.0791 1.1014 1.1040 1.1075 1.1043 1.0933 1.0900 1.0980 1.0740
irintensity: 0.4143 0.2354 1.3661 2.8755 0.4643 0.1980 1.9397 0.3217 0.1497 0.7653 1.4021 0.6664 5.6071 1.2129 3.5853 22.7353 10.0807 5.4955 5.0569 0.2420 2.7642 1.8803 1.6126 6.3919 11.3151 0.1033 1.9647 55.6997 90.1068 25.5533 1.1528 11.0942 2.6059 0.0531 0.3434 52.4695 2.9769 3.6268 6.1648 70.5551 46.4346 5.7845 0.0373 9.4575 6.4588 6.8516 43.0906 18.0675 17.1602 2.7475 0.4784 26.0199 17.7864 78.8147 0.6483 1.9659 0.3948 2.3929 269.3475 126.6859 8.0347 2.6124 17.8889 0.9346 0.3501 0.8671 11.5183 103.3610 43.6893 6.3855 14.3231 1.2014 275.0182 14.1113 24.4674 0.4609 0.2994 2.4330 7.4601 5.4331 9.4903 10.9551 110.2231 32.3793 68.2532 142.8157 2.9302 42.6819 8.1986 14.8469 67.1252 5.8308 10.2154 32.5669 17.0229 36.1725 85.6677 14.0528 9.5062 1.6272 3.5396 1.3679
temp: 298.150 k
press: 1.00000 atm
elementType: 53 16 8 7 7 6 6 6 6 6 6 6 6 6 6 6 6 1 1 1 1 1 1 1 1 1 1 1 1 1 1 1 1 1 1 1
symmnumber: 1
zpe: 764067.6 jmol-1
zpe.correction: 0.291018 hartree
zpe.thermalcorrener: 0.311086 hartree
zpe.thermalcorrenthalpy: 0.312030 hartree
zpe.thermalcorrgfe: 0.236025 hartree
zpe.sumelectzpe: -1061.613460 hartree
zpe.sumelectthermal: -1061.593392 hartree
zpe.sumelectthermalent: -1061.592448 hartree
zpe.sumelectthermalfe: -1061.668452 hartree
dipole: 0.4118 1.0009 1.9037
dipole: 2.1898
quadrupole: -157.6219 -122.2831 -125.5258
quadrupole: 0.6544 -18.3588 -0.3416
quadrupole: -22.4783 12.8605 9.6178 0.6544 -18.3588 -0.3416
hfenergy: -1061.9044776 hartree
pointgroup: C01 [X(C12H19I1N2O1S1)]
dipole: -0.1818227 -0.3299505 0.7747983 debye
polarizability: 317.6273084|-15.3243179|157.4714883|3.9261346|0.1600772|106.8574691 unknown
InChI: InChI=1S/C12H19IN2OS/c13-11-4-5-12(15-10-11)16-8-3-1-2-6-14-7-9-17/h4-5,10,14,17H,1-3,6-9H2
charge 0 multiplicity 1
36 atoms
I  -7.967956 1.155326 -0.192692
S  9.458448 0.653588 -0.29428
O  -2.052301 -0.971189 0.040424
N  5.404025 -0.307093 0.126504
N  -3.578908 0.839098 -0.036556
C  1.570154 0.236241 0.097511
C  2.92146 -0.512149 0.104402
C  0.357898 -0.723829 0.081098
C  4.129053 0.444715 0.132269
C  -0.962781 0.045581 0.050882
C  6.625824 0.524091 0.110478
C  7.853096 -0.351105 -0.190853
C  -3.352331 -0.499599 -0.006839
C  -4.392652 -1.468799 -0.022859
C  -5.720579 -1.010951 -0.074282
C  -4.870628 1.276999 -0.086408
C  -5.963143 0.387061 -0.107235
H  1.508614 0.8962 0.987909
H  1.527133 0.902681 -0.788973
H  3.004402 -1.159447 -0.789804
H  2.962103 -1.184237 0.988119
H  0.413132 -1.386955 -0.803459
H  0.379657 -1.376109 0.97536
H  4.03366 1.131327 1.012734
H  4.110261 1.086062 -0.771525
H  -1.09084 0.694585 0.937447
H  -1.057628 0.678575 -0.851059
H  5.428535 -1.007731 0.881375
H  6.792845 1.090289 1.062382
H  6.520598 1.279501 -0.69053
H  7.986828 -1.143725 0.566033
H  7.75035 -0.825705 -1.179379
H  -4.149961 -2.5338 0.003287
H  9.445759 1.088714 1.022366
H  -6.548942 -1.724897 -0.089055
H  -5.016783 2.36129 -0.109892
