program: Gaussian 09
title: 000218794
version: EM64L-G09RevD.01
frameworkgroup: C1[X(C12H18Br2N2OS)]
method: RPBEPBE
basis: SDD
operation: Freq
keyword: #p
keyword: freq=noraman
keyword: PBEPBE/SDD
title: #p freq=noraman PBEPBE/SDD
converged: YES YES NO NO
title: Mulliken charges:
elementType: Br Br S O N N C C C C C C C C C C C C H H H H H H H H H H H H H H H H H H
charge: 0.048291 0.026813 -0.028834 -0.244303 -0.285116 -0.049620 -0.361350 -0.390987 -0.391663 -0.374508 -0.284210 -0.288254 -0.705711 0.268239 -0.324178 -0.032847 -0.306783 -0.162082 0.190952 0.192515 0.222235 0.184257 0.214734 0.217623 0.212812 0.179191 0.226322 0.227889 0.242003 0.183999 0.229308 0.246976 0.283027 0.090572 0.279656 0.263032
chargesum: 0.00000
title: Mulliken charges with hydrogens summed into heavy atoms:
elementType: Br Br S O N N C C C C C C C C C C C C
charge: 0.048291 0.026813 0.061738 -0.244303 -0.043113 -0.049620 0.022116 0.015505 0.040694 0.017496 0.170001 0.125054 -0.175707 0.268239 -0.324178 0.246809 -0.043752 -0.162082
polarizability: 3.02192247e+02 -2.00043892e+01 2.03373533e+02 -1.54049970e+00 -2.36830421e+00 1.10667555e+02
1716.lowfreq: -2.6026 -1.4815 -0.0017 0.0006 0.0015 3.5340 12.4860 17.1421 30.5200
frequency: 12.4042 17.1231 30.3882 40.6621 53.5665 66.1322 84.2775 94.5925 101.3521 110.9822 121.6205 134.3202 139.5122 141.4808 164.0946 168.2655 199.4662 213.7889 239.1820 281.1224 300.9952 337.9149 352.6476 374.1182 449.1508 463.9435 469.2927 542.2696 548.0874 620.3356 671.0093 685.1715 689.7463 734.4799 738.8195 747.7778 772.5450 824.6697 837.5719 844.9994 891.5698 906.3769 937.7023 957.1296 994.8052 999.1169 1012.9869 1042.9212 1061.1532 1071.8107 1082.7053 1089.5344 1108.9034 1126.3695 1143.2604 1153.8323 1204.1470 1218.5232 1233.5005 1238.2051 1259.1832 1265.7195 1270.5289 1279.2281 1287.6489 1291.6533 1298.7993 1317.6200 1334.6806 1348.2440 1357.4128 1369.2820 1389.5298 1423.0338 1448.3162 1454.5283 1466.6477 1469.1146 1474.6960 1481.7960 1488.6664 1496.3650 1514.3481 1549.2985 2435.3463 2847.3492 2858.7002 2958.2388 2965.0741 2993.3170 2998.0371 3001.2729 3004.3840 3024.8777 3035.9188 3039.8936 3050.7342 3077.5014 3114.2057 3162.4933 3183.1515 3426.9830
redmass: 7.3090 11.1295 4.1556 2.1406 6.2661 4.4675 1.6907 12.1079 4.4362 3.5219 2.3893 3.1358 6.9236 3.9681 2.9655 2.9126 1.9828 1.7064 7.6561 6.5454 7.1708 9.5303 4.8181 5.3996 4.7345 3.8414 3.9517 5.0682 3.6898 8.8715 1.5547 5.7473 2.6764 8.0729 1.0690 1.2319 1.1114 7.4700 1.1584 1.1965 1.4292 1.3625 8.6102 1.2426 7.7368 2.9856 4.1706 2.3746 2.9000 2.0636 2.2948 2.3003 3.0733 1.3006 3.9097 1.2733 1.4347 1.8775 1.2940 1.2497 1.2877 3.5039 1.1407 1.1192 1.1079 1.1088 1.3201 3.5102 1.4417 2.2982 1.6613 1.6340 1.4569 2.4661 1.1363 1.1531 1.0889 1.0682 1.0957 1.0922 1.0967 1.0894 8.8366 7.3444 1.0382 1.0715 1.0714 1.0604 1.0637 1.0605 1.0830 1.0589 1.0967 1.0713 1.0770 1.1014 1.1041 1.1076 1.1043 1.0933 1.0937 1.0739
irintensity: 0.2999 0.1612 1.2775 3.1667 0.2877 0.1013 1.9254 0.4195 0.0897 0.1714 1.5642 1.6506 0.6931 0.0696 5.5748 1.0419 5.9493 24.9119 8.2455 3.3944 0.2131 0.0978 0.8959 5.0944 0.7228 2.6257 4.5527 1.8516 4.8722 11.0276 109.6455 55.7068 41.5502 16.6453 11.6146 2.8908 0.0585 14.3981 4.2053 2.6493 26.1765 1.3753 52.9038 1.3992 133.5574 5.9269 14.4179 8.7728 35.3105 16.6827 2.7526 12.3172 2.3310 16.3082 77.3006 0.5989 1.9539 0.3991 0.3658 9.0230 4.8665 300.6035 6.1885 2.9857 0.6064 0.4615 1.9731 21.9676 56.9203 76.0174 3.9758 66.8628 0.7214 333.6414 17.8392 21.8031 0.2703 0.6814 3.6785 5.0729 4.1890 9.4787 11.2857 66.2949 32.2306 66.4315 144.1964 3.3393 41.6561 3.9409 26.2738 49.8680 7.8652 8.5108 35.5002 21.8771 31.8446 77.5408 13.9224 7.5067 0.0806 1.2968
temp: 298.150 k
press: 1.00000 atm
elementType: 35 35 16 8 7 7 6 6 6 6 6 6 6 6 6 6 6 6 1 1 1 1 1 1 1 1 1 1 1 1 1 1 1 1 1 1
symmnumber: 1
zpe: 738145.3 jmol-1
zpe.correction: 0.281145 hartree
zpe.thermalcorrener: 0.302609 hartree
zpe.thermalcorrenthalpy: 0.303553 hartree
zpe.thermalcorrgfe: 0.224275 hartree
zpe.sumelectzpe: -1076.350976 hartree
zpe.sumelectthermal: -1076.329511 hartree
zpe.sumelectthermalent: -1076.328567 hartree
zpe.sumelectthermalfe: -1076.407846 hartree
dipole: 0.2777 -0.6761 1.9623
dipole: 2.0940
quadrupole: -165.6953 -135.3326 -134.0190
quadrupole: -0.4907 -17.7946 -0.1634
quadrupole: -20.6797 9.6830 10.9967 -0.4907 -17.7946 -0.1634
hfenergy: -1076.6321202 hartree
pointgroup: C01 [X(C12H18Br2N2O1S1)]
dipole: -0.1135353 0.2894576 0.7629179 debye
polarizability: 302.3569015|-19.4828606|203.2470371|2.8973134|-0.5920711|110.6293959 unknown
InChI: InChI=1S/C12H18Br2N2OS/c13-10-8-11(14)12(16-9-10)17-6-3-1-2-4-15-5-7-18/h8-9,15,18H,1-7H2
charge 0 multiplicity 1
36 atoms
Br -3.928726 -3.062487 0.02158
Br -7.52156 1.530176 -0.164901
S  9.700238 0.525071 -0.280381
O  -1.856141 -0.731899 0.031733
N  5.614555 -0.299663 0.125704
N  -3.329563 1.117058 -0.041434
C  1.800795 0.366536 0.090074
C  3.1277 -0.42441 0.097374
C  0.560275 -0.557006 0.070142
C  4.365156 0.493492 0.130344
C  -0.734811 0.253741 0.040677
C  6.863676 0.489934 0.11615
C  8.061186 -0.424836 -0.187316
C  -3.133744 -0.225505 -0.011018
C  -4.23025 -1.138528 -0.023252
C  -5.53942 -0.631984 -0.068703
C  -4.595384 1.618888 -0.085655
C  -5.719499 0.77275 -0.100515
H  1.758869 1.025874 0.982051
H  1.780188 1.035569 -0.795232
H  3.191649 -1.07166 -0.798331
H  3.145197 -1.099637 0.979322
H  0.560482 -1.211301 0.962883
H  0.595577 -1.219473 -0.815606
H  4.369256 1.137201 -0.771938
H  4.289668 1.180617 1.012369
H  -0.844915 0.904418 0.928181
H  -0.813947 0.887186 -0.862212
H  5.613539 -1.004198 0.877293
H  7.047591 1.045437 1.07117
H  6.785927 1.25231 -0.681384
H  8.165907 -1.226191 0.564929
H  7.945142 -0.889679 -1.178991
H  9.700195 0.949889 1.039713
H  -6.396095 -1.310238 -0.079315
H  -4.695815 2.707748 -0.108905
