program: Gaussian 09
title: 000218783
version: EM64L-G09RevD.01
frameworkgroup: C1[X(C14H18N2O4S2)]
method: RPBEPBE
basis: SDD
operation: Freq
keyword: #p
keyword: freq=noraman
keyword: PBEPBE/SDD
title: #p freq=noraman PBEPBE/SDD
converged: YES YES NO NO
title: Mulliken charges:
elementType: S S O O O O N N C C C C C C C C C C C C C C H H H H H H H H H H H H H H H H H H
charge: 0.062897 0.998963 -0.273098 -0.564497 -0.495825 -0.488329 -0.279327 -0.058734 -0.417357 -0.353024 -0.249474 -0.275778 0.118648 -0.743633 0.051066 0.426842 -0.355102 -0.400363 -0.351297 -0.232989 -0.344673 -0.223966 0.234255 0.206596 0.218164 0.201755 0.222598 0.221939 0.271055 0.246648 0.220602 0.295743 0.294193 0.266667 0.237676 0.234278 0.231404 0.230644 0.238098 0.376732
chargesum: 0.00000
title: Mulliken charges with hydrogens summed into heavy atoms:
elementType: S S O O O O N N C C C C C C C C C C C C C C
charge: 0.062897 0.998963 -0.273098 -0.187765 -0.495825 -0.488329 -0.008272 -0.058734 0.023494 0.066895 0.195063 0.191472 0.118648 -0.153697 0.051066 0.426842 -0.088435 -0.162686 -0.117018 -0.001585 -0.106574 0.006677
polarizability: 5.18856638e+02 1.86442670e-01 2.31039607e+02 -1.60876660e+01 2.96170993e+00 1.57325500e+02
1716.lowfreq: -12.3210 0.0010 0.0014 0.0016 2.1090 3.2930 10.0873 15.7706 17.1270
frequency: -3.4199 15.7348 16.7081 27.7983 31.4450 61.6447 72.2642 88.0651 104.9556 114.7187 125.1717 134.3350 143.8940 150.4374 164.3535 181.3540 186.0919 190.7248 203.7424 244.8284 268.0505 279.8505 295.6036 304.4990 320.5948 400.3619 409.4498 422.0302 452.6153 469.1508 472.3644 511.6126 523.0504 533.5767 578.7212 617.2906 634.3314 669.7720 695.2725 737.6904 749.2676 760.8668 770.0883 780.5022 792.2142 835.8513 841.7070 864.5164 867.5531 887.5955 934.5340 938.4653 956.4825 975.1811 983.4298 999.4984 1021.0362 1025.3280 1041.8063 1057.8443 1059.1355 1079.5173 1080.6316 1100.0214 1105.6269 1147.7777 1150.6351 1160.8969 1172.6074 1196.1796 1231.8176 1238.8338 1246.1947 1261.8571 1273.2775 1275.9414 1277.0053 1287.6819 1326.9793 1344.7321 1373.8730 1384.2038 1396.6162 1408.4303 1422.5310 1432.8429 1436.1706 1451.2265 1471.0032 1477.5725 1485.0238 1493.6690 1499.6743 1554.3823 1580.8388 1629.6228 2878.9463 2922.0869 2989.4498 2995.3259 2999.3174 3005.2219 3026.0415 3050.5409 3064.4640 3078.1387 3127.2544 3139.7290 3140.8870 3157.6942 3165.5396 3174.8652 3450.4680 3475.4701
redmass: 7.3748 6.8567 8.1384 5.5073 7.1111 5.5967 2.3906 2.8984 4.0149 2.2872 5.5013 3.0002 4.0676 3.3150 4.2107 5.6983 4.4336 4.7021 3.0887 3.1164 4.5474 3.1182 4.3755 7.8070 5.9693 4.4901 14.6347 3.0536 3.9306 5.8120 3.7883 6.3689 16.9459 6.4600 3.1236 1.3590 5.6431 4.6374 5.6388 6.2923 1.1539 1.3388 1.0837 6.4306 3.3118 1.3122 16.9417 1.6612 2.4679 1.5766 7.2035 3.9327 1.3741 1.3873 1.6096 1.3334 2.5805 3.1559 2.9463 1.4632 3.1374 2.8256 2.6757 2.9110 1.3398 1.4750 2.6627 1.4682 1.0831 1.3507 2.0439 1.2312 1.7583 1.1785 1.2115 1.8582 1.1860 1.1434 1.5538 1.6204 2.9880 1.6631 2.1289 2.1408 5.9676 1.0912 2.1628 1.2371 1.0829 1.0979 1.1003 1.1230 2.8444 6.7577 6.2846 6.8595 1.0701 1.0685 1.0674 1.0579 1.0652 1.0743 1.0923 1.1024 1.1040 1.1056 1.0859 1.0876 1.0899 1.0962 1.0988 1.0981 1.0748 1.0663
irintensity: 0.1497 0.6547 1.1713 0.1707 1.0327 1.2253 3.6618 1.1580 1.1622 0.9331 0.6449 3.4642 7.3053 0.1942 10.8621 31.0064 1.1777 1.5864 86.9240 18.5325 0.7086 31.9557 17.6564 11.2515 2.5822 28.2361 61.6217 4.5419 57.4259 2.9113 2.4415 34.3245 185.6786 0.4325 9.7003 265.9775 8.3527 15.8749 4.1616 28.4986 4.4313 26.4608 7.7934 4.6405 4.7366 78.0646 134.2571 8.1835 3.0778 7.9398 74.8518 56.0520 0.3549 2.9785 5.2454 0.0089 19.7043 9.5869 2.3200 43.5547 88.5696 52.3987 57.4722 3.9629 34.6091 15.8575 1.1710 9.0287 7.2814 92.0997 15.1504 12.1947 78.7524 9.9495 5.4078 62.0104 7.5575 10.5199 152.9993 164.3013 3.4928 227.8923 19.5805 0.6341 7.8303 10.4608 13.4759 27.4432 0.6036 12.7233 10.9762 17.1949 49.7249 59.5048 26.8544 17.0069 77.5843 21.1605 2.7662 5.3719 23.5579 46.3802 19.5785 0.4654 3.2921 53.8612 0.7699 11.2761 7.7825 27.9086 41.8832 14.5013 39.6283 92.3313
temp: 298.150 k
press: 1.00000 atm
elementType: 16 16 8 8 8 8 7 7 6 6 6 6 6 6 6 6 6 6 6 6 6 6 1 1 1 1 1 1 1 1 1 1 1 1 1 1 1 1 1 1
symmnumber: 1
zpe: 797277.5 jmol-1
zpe.correction: 0.303667 hartree
zpe.thermalcorrener: 0.326736 hartree
zpe.thermalcorrenthalpy: 0.327680 hartree
zpe.thermalcorrgfe: 0.247190 hartree
zpe.sumelectzpe: -1748.969194 hartree
zpe.sumelectthermal: -1748.946125 hartree
zpe.sumelectthermalent: -1748.945181 hartree
zpe.sumelectthermalfe: -1749.025671 hartree
dipole: -4.6079 1.9189 2.5521
dipole: 5.6061
quadrupole: -152.5964 -136.5349 -153.9406
quadrupole: 10.1890 17.7491 0.8856
quadrupole: -4.9058 11.1557 -6.2500 10.1890 17.7491 0.8856
hfenergy: -1749.2728612 hartree
pointgroup: C01 [X(C14H18N2O4S2)]
dipole: -1.7688189 -0.5754557 -1.1852683 debye
polarizability: 517.8114219|3.2766482|226.6816918|24.5544972|18.1228871|162.7286315 unknown
InChI: InChI=1S/C14H17N2OS.HO3S/c18-11-9-15-7-3-10-17-14-13-5-2-1-4-12(13)6-8-16-14;1-4(2)3/h1-2,4-6,8,15H,3,7,9-11H2;1H
charge 0 multiplicity 1
40 atoms
S  6.874509 0.938777 -1.160131
S  7.665644 0.03228 1.016288
O  -2.010939 0.01988 -0.06054
O  7.643826 -1.798636 0.633984
O  9.181379 0.484978 1.33818
O  6.492796 0.148649 2.114967
N  2.866858 0.206277 -0.40359
N  -3.399359 1.805908 0.598955
C  0.390796 0.138996 -0.220044
C  1.66913 0.979294 -0.025711
C  -0.861876 0.93504 0.15277
C  4.159116 0.907781 -0.353212
C  -4.384858 -0.365147 -0.034262
C  5.213535 0.061084 -1.082836
C  -3.276526 0.538609 0.186111
C  -5.707459 0.160267 0.213815
C  -4.220169 -1.713462 -0.474433
C  -6.835116 -0.69807 0.00763
C  -5.828811 1.523287 0.656909
C  -5.341725 -2.528063 -0.666583
C  -4.678198 2.287098 0.831301
C  -6.654527 -2.015952 -0.424013
H  0.325844 -0.190044 -1.272715
H  0.437664 -0.772414 0.408576
H  1.630609 1.880147 -0.670016
H  1.722203 1.344259 1.029689
H  -0.994798 1.831917 -0.480292
H  -0.857132 1.264301 1.208697
H  2.893858 -0.730324 0.021229
H  4.513293 1.122759 0.681684
H  4.045519 1.879598 -0.870321
H  4.921365 -0.142461 -2.13059
H  5.376091 -0.914562 -0.586778
H  -3.208844 -2.088461 -0.655526
H  -7.842024 -0.306702 0.19358
H  -6.815495 1.953456 0.854718
H  -5.218626 -3.562753 -1.00424
H  -7.523556 -2.665102 -0.578969
H  -4.729836 3.327494 1.167903
H  8.500242 -2.014781 0.160915
