program: Gaussian 09
title: 000218779
version: EM64L-G09RevD.01
frameworkgroup: C1[X(C17H24N2O5S2)]
method: RPBEPBE
basis: SDD
operation: Freq
keyword: #p
keyword: freq=noraman
keyword: PBEPBE/SDD
title: #p freq=noraman PBEPBE/SDD
converged: YES YES NO NO
title: Mulliken charges:
elementType: S S O O O O O N N C C C C C C C C C C C C C C C C C H H H H H H H H H H H H H H H H H H H H H H H H
charge: 0.098358 0.967165 -0.268293 -0.271916 -0.553099 -0.498403 -0.502640 -0.279988 -0.056723 -0.360649 -0.391777 -0.395929 -0.366577 -0.279767 -0.265802 -0.762597 0.099196 0.227570 -0.031676 0.329271 -0.490618 -0.363601 -0.314437 -0.249418 -0.221457 -0.529256 0.192169 0.194768 0.220619 0.190981 0.211781 0.209958 0.201391 0.218418 0.222344 0.219222 0.273059 0.219987 0.220827 0.299727 0.312121 0.261485 0.264782 0.256515 0.228454 0.228447 0.248244 0.229378 0.229380 0.379006
chargesum: 0.00000
title: Mulliken charges with hydrogens summed into heavy atoms:
elementType: S S O O O O O N N C C C C C C C C C C C C C C C C C
charge: 0.098358 0.967165 -0.268293 -0.271916 -0.174092 -0.498403 -0.502640 -0.006928 -0.056723 0.026288 0.019823 0.025810 0.053233 0.161798 0.175012 -0.150749 0.099196 0.227570 -0.031676 0.329271 -0.229134 -0.098819 -0.057922 -0.020965 0.006990 0.177746
polarizability: 5.67517479e+02 1.45805093e+01 2.69174208e+02 -2.13195833e+01 4.32882610e-01 1.79954399e+02
1716.lowfreq: -5.5290 -3.7662 -1.8097 0.0015 0.0019 0.0021 7.5332 8.7067 13.9130
frequency: 3.7989 8.6714 13.7093 19.3027 28.1515 37.7726 46.2092 60.6634 77.4421 88.7910 94.6436 105.3826 110.4140 118.1520 127.5140 133.3075 145.3970 149.7631 164.5458 180.7943 181.4471 192.4602 198.3549 208.5474 216.5026 243.0848 260.5578 271.6723 286.1815 307.2087 317.7227 326.6812 340.9996 402.4460 407.5610 432.0266 435.2041 475.6390 479.0841 525.1763 527.3159 536.8710 538.5854 598.5109 607.2097 633.8188 676.5012 682.6816 699.6678 735.4064 751.7088 754.3185 767.9462 776.2855 781.4724 827.5318 837.9316 840.1968 849.8372 883.7170 910.6867 928.7195 950.0409 952.2404 968.5342 978.7979 994.3429 995.9763 1017.0784 1023.1112 1027.2583 1051.9047 1058.8496 1062.3889 1081.7198 1086.7456 1107.4657 1113.9545 1118.2350 1128.9156 1152.4803 1159.7322 1161.0010 1163.0900 1169.8809 1187.8541 1227.8469 1232.8560 1246.6787 1260.4133 1270.4336 1285.3948 1287.9065 1288.5846 1289.7771 1295.6712 1320.8309 1335.6502 1348.6761 1359.0617 1377.7669 1382.6495 1407.8637 1421.0654 1424.0275 1439.8361 1453.4187 1453.9867 1465.4718 1466.0151 1468.4187 1471.5876 1472.9801 1480.1667 1487.0579 1491.5206 1511.8732 1554.9247 1589.6326 1625.0398 2873.7842 2911.0985 2954.0568 2959.2990 2966.9362 2970.8257 2988.3670 2996.6263 3000.4441 3004.7588 3023.2442 3036.2311 3047.4627 3058.1407 3063.4466 3071.1160 3130.6514 3133.6537 3147.4149 3164.0421 3172.8611 3192.9934 3450.7117 3464.3256
redmass: 7.3160 6.3985 6.1471 6.3556 7.9941 4.0398 3.1749 3.0373 3.1707 3.2226 5.4357 2.4034 3.3383 2.7494 3.1909 3.1672 2.7068 5.9497 2.8464 4.2613 1.7311 3.5564 1.5062 4.3462 4.5778 4.8259 2.3146 7.8231 5.9251 5.5891 6.0923 4.6032 3.9024 13.1747 5.1905 3.3030 4.0391 5.6121 4.0892 6.0052 11.7510 3.3762 6.7584 1.3056 5.1907 4.4162 4.6300 6.5750 4.1267 1.0685 1.3307 4.4495 1.1198 1.4511 2.7062 13.4666 1.2346 1.5453 6.7151 1.5625 7.9667 8.9494 5.0121 1.3853 1.3650 2.0333 1.3166 4.9814 3.7457 2.1349 2.4245 2.7998 1.3687 2.8107 2.2251 3.6060 3.1874 1.2602 1.2909 1.9191 1.4580 1.3569 2.8205 1.6506 1.2074 1.4376 1.2955 1.2429 1.7588 1.2360 1.1562 1.1159 1.1932 2.1989 1.1182 1.3042 1.9858 1.6975 2.3536 1.7563 1.4915 1.9672 5.5127 2.5712 1.0728 1.3119 2.2590 1.3927 1.0792 1.0493 1.0720 1.0862 1.1062 1.0946 1.0871 1.0956 4.1507 8.0665 6.9501 7.0492 1.0700 1.0694 1.0642 1.0597 1.0632 1.0323 1.0600 1.0574 1.0849 1.0984 1.0899 1.1022 1.1042 1.0972 1.1044 1.1071 1.0858 1.1006 1.0898 1.0951 1.0996 1.0919 1.0660 1.0751
irintensity: 0.3413 0.1080 0.0250 0.9770 0.6890 2.0389 1.9375 0.7670 1.7187 4.0729 11.8080 0.2416 1.8735 4.1761 7.2181 2.8186 1.3175 10.3955 4.3099 2.1320 61.7670 7.5858 3.8378 64.0590 0.3195 21.0507 5.6701 33.6662 0.6998 7.9392 0.0994 5.5869 26.3576 41.9178 25.4392 3.6759 37.9653 17.5750 10.6459 63.6216 206.5219 4.9246 1.9560 224.6894 4.0255 3.0950 0.1936 18.9025 1.0413 8.7160 7.6433 6.8135 1.7703 74.0898 13.3043 65.0464 6.4852 44.0603 0.5992 0.2226 8.5659 76.9804 28.1235 5.8813 2.7592 2.2896 0.0010 72.9103 52.7234 3.4189 26.9745 11.1491 38.2027 38.8759 2.2953 81.4549 6.9021 0.1197 58.0225 99.3968 3.8571 40.4000 30.8595 200.5575 47.3034 85.5350 21.0517 10.3492 21.3958 3.5979 16.8953 2.6927 14.8129 6.0409 14.2239 5.0843 218.5880 19.7312 117.3520 26.9252 59.3900 42.0270 32.3303 52.2995 13.7744 78.2855 67.9039 7.4129 2.7323 14.7955 0.2647 26.4952 6.6304 1.2611 16.2013 16.0127 105.0138 108.7372 306.2783 59.2609 87.0981 45.0099 3.6107 4.5566 35.5364 52.7744 12.1279 37.4328 37.4702 1.0364 20.3073 8.9235 35.4166 10.0990 37.1561 90.1558 4.2008 19.7477 13.6246 14.4263 24.8102 3.1157 98.6216 42.3825
temp: 298.150 k
press: 1.00000 atm
elementType: 16 16 8 8 8 8 8 7 7 6 6 6 6 6 6 6 6 6 6 6 6 6 6 6 6 6 1 1 1 1 1 1 1 1 1 1 1 1 1 1 1 1 1 1 1 1 1 1 1 1
symmnumber: 1
zpe: 1024954.9 jmol-1
zpe.correction: 0.390385 hartree
zpe.thermalcorrener: 0.420028 hartree
zpe.thermalcorrenthalpy: 0.420972 hartree
zpe.thermalcorrgfe: 0.321676 hartree
zpe.sumelectzpe: -1941.774263 hartree
zpe.sumelectthermal: -1941.744620 hartree
zpe.sumelectthermalent: -1941.743676 hartree
zpe.sumelectthermalfe: -1941.842972 hartree
dipole: -4.5457 2.4507 0.6576
dipole: 5.2060
quadrupole: -194.7603 -159.1637 -176.0375
quadrupole: -7.4902 2.6769 -3.0831
quadrupole: -18.1065 17.4901 0.6163 -7.4902 2.6769 -3.0831
hfenergy: -1942.164648 hartree
pointgroup: C01 [X(C17H24N2O5S2)]
dipole: -1.7768568 -0.8462791 -0.5671358 debye
polarizability: 566.6873983|-20.6658457|261.259053|24.0046935|24.9397107|188.6996346 unknown
InChI: InChI=1S/C17H23N2O2S.HO3S/c1-20-16-13-17(19-15-8-4-3-7-14(15)16)21-11-6-2-5-9-18-10-12-22;1-4(2)3/h3-4,7-8,13,18H,2,5-6,9-12H2,1H3;1H
charge 0 multiplicity 1
50 atoms
S  8.841679 0.767049 -1.174734
S  9.993128 0.020492 0.894692
O  -2.521665 -0.871267 -0.317854
O  -7.251126 -1.869474 -0.646438
O  11.399474 -0.878413 0.073105
O  10.642886 1.182301 1.814999
O  9.019848 -1.071583 1.60334
N  4.916659 -0.102578 -0.224794
N  -4.077963 0.830875 0.192343
C  1.079555 0.355818 -0.047053
C  2.438336 -0.359276 -0.216155
C  -0.120258 -0.600011 -0.240752
C  3.632114 0.608466 -0.096722
C  -1.453271 0.122727 -0.038851
C  6.145162 0.693162 -0.30555
C  7.280817 -0.202995 -0.839879
C  -3.833916 -0.426962 -0.187615
C  -6.509877 0.31209 0.024252
C  -5.414122 1.211904 0.303435
C  -6.168749 -1.034967 -0.384516
C  -4.830758 -1.413571 -0.491548
C  -7.855348 0.766249 0.156422
C  -5.712185 2.54851 0.710483
C  -8.118333 2.081871 0.557095
C  -7.039682 2.975392 0.835181
C  -6.964713 -3.246612 -1.066936
H  1.008344 1.187421 -0.778584
H  1.028004 0.819552 0.959828
H  2.484343 -0.861057 -1.201883
H  2.529427 -1.156204 0.551799
H  -0.094517 -1.033874 -1.258931
H  -0.051746 -1.444855 0.471612
H  3.558781 1.17037 0.867233
H  3.580167 1.363991 -0.905759
H  -1.574823 0.501685 0.993065
H  -1.573576 0.979056 -0.729138
H  4.994492 -0.932779 0.375996
H  6.462441 1.144355 0.6636
H  5.966656 1.531096 -1.006492
H  6.995455 -0.707175 -1.781153
H  7.543236 -0.985776 -0.096577
H  -4.505496 -2.410177 -0.79339
H  -8.669219 0.068231 -0.060337
H  -4.870255 3.216047 0.918213
H  -9.152287 2.428753 0.65838
H  -7.254528 4.003267 1.148575
H  -7.949838 -3.711728 -1.213869
H  -6.402482 -3.79049 -0.284434
H  -6.394836 -3.260053 -2.01528
H  12.153865 -0.906553 0.73497
