program: Gaussian 09
title: 000218776
version: EM64L-G09RevD.01
frameworkgroup: C1[X(C17H23ClN2O4S2)]
method: RPBEPBE
basis: SDD
operation: Freq
keyword: #p
keyword: freq=noraman
keyword: PBEPBE/SDD
title: #p freq=noraman PBEPBE/SDD
converged: YES YES NO NO
title: Mulliken charges:
elementType: Cl S S O O O O N N C C C C C C C C C C C C C C C C C H H H H H H H H H H H H H H H H H H H H H H H
charge: -0.034210 0.096970 0.970420 -0.256566 -0.559046 -0.503356 -0.497003 -0.279503 -0.018074 -0.361586 -0.392846 -0.393552 -0.365872 -0.286728 -0.266115 0.100509 -0.762061 0.273884 0.418068 0.042216 -0.501720 -0.391539 -0.812511 -0.228235 -0.254018 -0.250937 0.194604 0.195395 0.221108 0.190236 0.211998 0.211006 0.200827 0.219298 0.225279 0.227469 0.272741 0.229414 0.220287 0.297971 0.309491 0.258033 0.244360 0.238335 0.238235 0.238532 0.233136 0.256624 0.379033
chargesum: 0.00000
title: Mulliken charges with hydrogens summed into heavy atoms:
elementType: Cl S S O O O O N N C C C C C C C C C C C C C C C C C
charge: -0.034210 0.096970 0.970420 -0.256566 -0.180013 -0.503356 -0.497003 -0.006762 -0.018074 0.028414 0.018498 0.029452 0.054253 0.166019 0.183585 0.100509 -0.154599 0.273884 0.418068 0.042216 -0.243686 -0.147179 -0.097409 -0.228235 -0.020883 0.005687
polarizability: 5.68440414e+02 -4.12020286e+00 2.74129885e+02 2.54824210e+01 3.03298279e+00 1.81666466e+02
1716.lowfreq: -7.4558 -0.0018 -0.0013 0.0019 3.1990 4.1983 10.0988 12.4265 16.4813
frequency: 9.1490 12.2320 16.0175 21.7129 29.1869 36.8838 41.8757 56.7830 64.2700 83.9070 97.2184 107.5259 111.9112 124.2759 125.1371 140.4901 147.8906 156.5962 162.3140 175.0489 182.0639 187.6600 192.6473 213.5167 228.9987 237.0147 242.0127 271.3884 286.5433 305.1412 309.5232 328.7547 330.9456 377.6548 404.4269 405.4170 440.0138 463.2842 477.4085 492.6790 517.2986 525.0472 554.2914 560.7385 596.9275 598.4807 608.3229 685.9228 700.3012 708.6013 733.2689 748.0968 759.1250 765.0990 795.2383 808.8621 827.3879 835.0450 854.8365 883.4627 902.2756 909.4805 931.0465 951.5125 970.3843 976.7947 981.6224 1009.3024 1019.3284 1025.5095 1046.2385 1054.3155 1060.0614 1064.6910 1071.9578 1082.0253 1082.3674 1108.8072 1118.6350 1151.9605 1157.2191 1159.1040 1179.6131 1186.4542 1214.9762 1228.3821 1233.5584 1259.6292 1270.7502 1276.8380 1284.8223 1287.1781 1290.6256 1296.2088 1319.4227 1334.1107 1346.3949 1359.0268 1379.8796 1382.1835 1388.3492 1401.1609 1412.9383 1424.5656 1443.1731 1457.1263 1464.0457 1466.5474 1469.5013 1471.4348 1477.6149 1480.1249 1485.9267 1490.2922 1503.0295 1544.2877 1605.5411 1611.3210 2874.9289 2916.3164 2953.2820 2958.6350 2965.4697 2980.9771 2988.7129 2996.8933 3001.2618 3004.5599 3024.6125 3036.2137 3048.6901 3055.2767 3058.3258 3074.4010 3096.6429 3140.0700 3157.9208 3168.9475 3173.8380 3454.0736 3459.7238
redmass: 7.3835 6.4359 6.2278 6.5150 6.2705 4.1421 3.1580 4.0893 3.5731 3.5917 3.1869 3.7149 2.6422 3.7055 2.8669 2.3382 4.8772 3.5130 3.3000 1.2980 2.6764 3.0445 4.0076 4.1083 5.6903 3.1864 4.5508 4.6573 5.2587 6.1665 5.4623 5.9591 4.2650 7.8373 7.5151 6.6773 4.4117 4.1323 3.9138 4.5830 6.6633 17.1828 3.5787 5.5318 4.5571 3.4137 1.4103 4.5641 4.6540 7.0020 1.0685 1.2338 1.5707 1.1189 6.9128 3.2389 14.2169 1.2146 6.2828 1.3817 1.3891 8.1753 9.1071 1.2316 1.3300 2.1583 2.4714 2.8645 2.8655 2.8069 1.5657 2.5641 1.4590 2.6533 2.9153 2.2728 2.3047 2.8708 1.3439 1.5980 1.9492 2.4863 1.3461 1.4428 1.6183 1.2813 1.2538 1.2396 1.1447 2.8275 1.1093 1.1009 1.1196 1.3314 2.3943 1.6253 1.9860 1.7195 1.5538 2.8904 2.6080 1.3018 3.0767 1.0739 3.1491 1.2466 1.0808 1.0694 1.0455 1.0890 1.1077 1.1250 1.0939 1.0942 4.7330 8.5907 6.1035 7.4984 1.0701 1.0691 1.0638 1.0609 1.0626 1.0379 1.0604 1.0848 1.0574 1.0983 1.0903 1.1018 1.1039 1.0977 1.0972 1.1074 1.0986 1.0861 1.0930 1.0931 1.0987 1.0660 1.0751
irintensity: 0.5792 0.3492 0.1717 0.3855 1.1602 1.1743 1.9916 1.1518 0.5823 0.5638 0.3057 14.5189 12.9666 1.5687 2.9286 6.9465 9.2557 4.9272 0.1632 0.0969 44.2112 33.2775 0.0121 45.3266 3.7774 3.7419 10.9028 23.1962 9.7602 13.5212 4.8259 3.9268 24.6938 1.5397 25.6345 47.9837 17.8676 0.1538 24.5027 16.8506 0.2267 196.7979 1.5999 7.1189 1.9263 12.9128 228.3541 0.1103 3.2641 32.4807 8.7752 12.4792 55.4057 3.2432 21.2628 14.6679 97.4504 3.5339 5.1292 26.0828 1.4846 25.9570 74.8571 10.3415 0.7361 3.9892 27.7329 5.6833 68.3412 14.9850 6.7741 23.5255 32.2216 39.3684 3.2406 2.6102 21.1644 14.5270 35.0389 12.9287 95.4099 22.3994 119.9905 81.8239 11.0646 31.8406 1.5117 3.0397 13.9549 67.7928 2.0413 0.8899 20.9821 4.2470 173.1524 33.6581 138.1909 29.2525 66.7875 3.8817 63.9418 17.7102 43.7536 14.4714 33.3931 37.0116 5.4938 0.3430 15.5301 2.7700 53.5597 34.5659 7.2362 16.5828 41.6122 92.5611 161.8915 43.6531 85.1830 34.3802 3.9363 1.0686 37.8957 22.2445 18.2722 31.7012 29.6235 2.3217 21.5714 10.3322 42.9901 8.2541 14.3878 74.7867 18.6421 1.1709 14.2878 4.8971 15.0727 78.7862 39.2328
temp: 298.150 k
press: 1.00000 atm
elementType: 17 16 16 8 8 8 8 7 7 6 6 6 6 6 6 6 6 6 6 6 6 6 6 6 6 6 1 1 1 1 1 1 1 1 1 1 1 1 1 1 1 1 1 1 1 1 1 1 1
symmnumber: 1
zpe: 988805.2 jmol-1
zpe.correction: 0.376616 hartree
zpe.thermalcorrener: 0.406460 hartree
zpe.thermalcorrenthalpy: 0.407404 hartree
zpe.thermalcorrgfe: 0.308775 hartree
zpe.sumelectzpe: -2326.037129 hartree
zpe.sumelectthermal: -2326.007285 hartree
zpe.sumelectthermalent: -2326.006341 hartree
zpe.sumelectthermalfe: -2326.104970 hartree
dipole: 6.9094 -1.3974 -0.1205
dipole: 7.0504
quadrupole: -199.0482 -175.0853 -176.0671
quadrupole: -24.2843 2.4689 -2.8817
quadrupole: -15.6479 8.3149 7.3331 -24.2843 2.4689 -2.8817
hfenergy: -2326.4137449 hartree
pointgroup: C01 [X(C17H23Cl1N2O4S2)]
dipole: -2.7255476 -0.5138264 0.0384544 debye
polarizability: 568.5253736|-0.3773954|274.1712928|25.2277449|-1.4987069|181.540099 unknown
InChI: InChI=1S/C17H22ClN2OS.HO3S/c1-13-12-16(20-17-14(13)6-5-7-15(17)18)21-10-4-2-3-8-19-9-11-22;1-4(2)3/h5-7,12,19H,2-4,8-11H2,1H3;1H
charge 0 multiplicity 1
49 atoms
Cl -4.499405 3.314972 0.157492
S  8.81811 0.619157 -1.408611
S  9.967464 -0.046632 0.690439
O  -2.463904 -1.388403 0.012904
O  9.762376 1.573014 1.58639
O  9.015104 -1.146217 1.415249
O  11.555575 -0.339273 0.591361
N  4.925564 -0.340927 -0.412641
N  -4.087116 0.316371 0.101614
C  1.082922 0.015257 -0.134102
C  2.460417 -0.669718 -0.273718
C  -0.080827 -1.002271 -0.119572
C  3.624812 0.339498 -0.277923
C  -1.438702 -0.307613 -0.013374
C  6.126088 0.491965 -0.545859
C  -3.788667 -0.98569 0.071851
C  7.282237 -0.386623 -1.061188
C  -6.491049 -0.321719 0.182474
C  -6.113055 -1.724783 0.150056
C  -5.424913 0.663997 0.156228
C  -4.759164 -2.043648 0.095033
C  -7.851321 0.111375 0.238492
C  -7.164683 -2.814172 0.175434
C  -5.799664 2.046802 0.188509
C  -8.167389 1.473671 0.267803
C  -7.133446 2.454842 0.242742
H  0.941667 0.729035 -0.972042
H  1.060929 0.617976 0.797358
H  2.497209 -1.26111 -1.208911
H  2.596906 -1.387155 0.563132
H  -0.058215 -1.614742 -1.041542
H  0.03729 -1.69922 0.732686
H  3.574805 0.966342 0.646709
H  3.514512 1.034137 -1.134566
H  -1.535375 0.295465 0.908767
H  -1.643654 0.356733 -0.873198
H  5.042519 -1.139666 0.22402
H  6.442402 0.992011 0.398935
H  5.908724 1.293951 -1.277086
H  7.013816 -0.916684 -1.993642
H  7.56109 -1.146805 -0.300675
H  -4.410851 -3.079396 0.068154
H  -8.655124 -0.631075 0.258667
H  -7.783138 -2.756481 1.090758
H  -7.851557 -2.732141 -0.687771
H  -6.698408 -3.81233 0.143814
H  -9.211338 1.800472 0.310471
H  -7.378202 3.520775 0.265944
H  10.477927 1.610779 2.289337
