program: Gaussian 09
title: 000218769
version: EM64L-G09RevD.01
frameworkgroup: C1[X(C16H21ClN2O4S2)]
method: RPBEPBE
basis: SDD
operation: Freq
keyword: #p
keyword: freq=noraman
keyword: PBEPBE/SDD
title: #p freq=noraman PBEPBE/SDD
converged: YES YES NO NO
title: Mulliken charges:
elementType: Cl S S O O O O N N C C C C C C C C C C C C C C C C H H H H H H H H H H H H H H H H H H H H H
charge: -0.041104 0.098425 0.970668 -0.256661 -0.558949 -0.502535 -0.495721 -0.279736 -0.047119 -0.362143 -0.392297 -0.393747 -0.365557 -0.289318 -0.265803 -0.762911 0.105486 0.433952 -0.064117 -0.333787 -0.135201 -0.353957 -0.304379 -0.246313 -0.221173 0.193397 0.194633 0.221800 0.191097 0.213048 0.214103 0.218430 0.199909 0.223008 0.224313 0.272461 0.229117 0.220069 0.298684 0.309205 0.279623 0.253916 0.260665 0.233305 0.233757 0.379455
chargesum: 0.00000
title: Mulliken charges with hydrogens summed into heavy atoms:
elementType: Cl S S O O O O N N C C C C C C C C C C C C C C C C
charge: -0.041104 0.098425 0.970668 -0.256661 -0.179493 -0.502535 -0.495721 -0.007275 -0.047119 0.025887 0.020600 0.033404 0.052782 0.158003 0.183384 -0.155022 0.105486 0.433952 -0.064117 -0.054164 -0.135201 -0.100041 -0.043715 -0.013008 0.012585
polarizability: 5.55421278e+02 1.62339296e+01 2.58927700e+02 2.58093805e+01 2.21565457e+00 1.73411794e+02
1716.lowfreq: -1.3369 -0.0024 -0.0023 0.0005 2.2208 5.6768 8.0112 12.5784 16.1006
frequency: 6.9592 12.0926 16.0182 19.9020 30.7661 40.4972 52.4110 65.0401 76.7898 101.6697 106.6847 109.9953 112.6742 124.2007 129.5978 141.9521 147.7036 160.3310 163.3913 187.3833 199.6328 213.4272 217.7983 219.6707 242.0776 271.8233 293.2914 306.3849 309.8958 331.9274 357.5628 396.9060 403.5670 418.8010 436.2998 474.7399 509.8366 525.4420 525.7053 530.8035 568.9417 586.1784 607.3951 654.6108 670.8519 700.7728 735.1328 738.2477 746.5036 766.9344 774.1010 775.8427 804.8663 827.5131 837.3414 865.4077 880.9579 900.4251 931.2823 938.0590 952.7901 966.5354 978.4332 986.6406 995.3706 1015.8487 1023.4445 1026.8511 1055.4099 1061.4999 1064.8166 1082.3707 1107.6538 1113.0390 1118.5391 1151.3700 1155.5048 1158.1245 1172.3637 1186.1790 1228.3859 1234.1336 1246.8083 1259.7125 1269.0268 1271.8916 1286.1281 1287.7824 1292.0793 1295.6329 1304.5369 1332.3288 1346.0191 1358.8476 1376.4542 1382.2383 1393.4110 1409.1049 1424.3088 1452.8701 1456.5076 1465.2120 1467.5378 1472.8062 1479.8348 1486.2369 1490.6044 1492.0876 1547.4317 1590.3084 1622.9671 2874.6429 2915.7983 2954.8519 2958.9907 2966.2857 2990.3616 2997.4258 2999.0820 3004.6656 3024.8883 3037.5401 3048.6820 3054.6838 3073.5329 3135.2818 3148.0098 3163.2363 3173.6783 3196.2864 3453.3365 3458.0756
redmass: 7.5794 7.7251 7.2929 6.7393 8.8729 6.0912 3.0638 2.3929 3.4642 3.7427 6.1765 2.5557 3.4877 3.0369 2.9196 2.5230 6.8391 2.7610 4.1799 1.9675 6.9874 4.3721 4.7576 5.0616 4.6113 7.2230 7.7440 5.9658 6.2513 4.2296 7.6153 5.9469 13.1805 3.3840 4.2064 3.6655 6.1078 11.2817 8.4633 3.4449 5.0860 5.2732 1.2973 6.8135 4.2202 4.5589 1.0705 6.0781 1.2385 1.1227 2.1772 1.7237 8.0284 14.7064 1.2099 1.4643 1.5382 7.1473 9.2324 7.4786 1.2340 1.3593 2.0261 4.9678 1.3236 3.8676 2.2369 2.3432 2.6809 1.4280 2.6174 2.2365 2.6923 2.0714 1.3544 1.5611 1.3323 2.5652 1.1741 1.4467 1.2897 1.2525 1.7688 1.3003 2.1897 1.3611 1.1055 1.1014 1.1656 1.6892 1.7339 1.3988 2.0438 1.7655 2.2743 1.4645 3.7743 3.0442 1.0761 2.8856 1.2486 1.0868 1.0707 1.1043 1.1010 1.1335 1.4561 1.9324 7.4249 7.9591 6.9140 1.0702 1.0692 1.0638 1.0604 1.0633 1.0604 1.0812 1.0604 1.0986 1.0902 1.1019 1.1041 1.0979 1.1073 1.0857 1.0893 1.0953 1.1003 1.0942 1.0661 1.0750
irintensity: 0.4377 0.1679 0.3045 0.2739 0.8054 0.7026 2.4058 0.2212 0.4477 0.6748 2.9997 0.2018 16.1141 6.0376 0.5272 4.4649 11.6623 4.8026 0.1484 69.8531 1.0655 56.4054 1.0455 7.5302 11.7850 24.9436 5.8684 13.8033 0.4277 18.6882 34.4509 10.9498 43.9503 6.6377 16.0628 34.5628 6.3873 148.8757 53.3946 3.4384 2.4405 0.0009 232.6346 22.3518 0.2560 1.4419 8.9230 16.1067 13.9250 2.0566 31.0097 61.1130 25.3508 96.4559 3.8088 32.2178 0.1625 0.3121 79.7047 115.0825 8.1514 2.6313 3.1982 61.2651 0.0340 45.3676 1.2762 7.9386 16.4574 35.4770 43.2556 1.2204 0.3176 71.6473 23.9733 6.4708 46.7437 16.9511 32.0633 87.5395 31.5601 1.7134 44.0758 15.7660 103.4924 87.4808 0.2810 3.6104 16.4770 3.2227 49.7379 100.2691 135.6980 14.2009 36.3039 58.9353 59.3686 66.8731 14.8082 63.5424 31.5008 1.8573 0.1732 1.3629 2.1836 25.6165 11.6607 69.2878 86.2108 256.3190 50.2154 88.5738 34.4415 3.6474 2.9383 37.4747 9.6189 20.2218 53.4525 2.7919 22.1534 12.4036 33.5816 8.0434 82.1452 2.8481 6.1129 14.9112 22.7187 1.0055 80.0149 36.8135
temp: 298.150 k
press: 1.00000 atm
elementType: 17 16 16 8 8 8 8 7 7 6 6 6 6 6 6 6 6 6 6 6 6 6 6 6 6 1 1 1 1 1 1 1 1 1 1 1 1 1 1 1 1 1 1 1 1 1
symmnumber: 1
zpe: 917107.3 jmol-1
zpe.correction: 0.349308 hartree
zpe.thermalcorrener: 0.377440 hartree
zpe.thermalcorrenthalpy: 0.378384 hartree
zpe.thermalcorrgfe: 0.283302 hartree
zpe.sumelectzpe: -2286.808541 hartree
zpe.sumelectthermal: -2286.780409 hartree
zpe.sumelectthermalent: -2286.779465 hartree
zpe.sumelectthermalfe: -2286.874547 hartree
dipole: 4.0873 2.4780 0.0228
dipole: 4.7799
quadrupole: -223.4987 -168.1263 -169.9413
quadrupole: 0.8199 3.0309 -3.4156
quadrupole: -36.3099 19.0625 17.2475 0.8199 3.0309 -3.4156
hfenergy: -2287.1578489 hartree
pointgroup: C01 [X(C16H21Cl1N2O4S2)]
dipole: -1.6314682 0.9351956 -0.0126647 debye
polarizability: 556.2152354|-8.7178813|258.2708787|24.5985297|-2.4111218|173.2746575 unknown
InChI: InChI=1S/C16H20ClN2OS.HO3S/c17-14-12-16(19-15-7-3-2-6-13(14)15)20-10-5-1-4-8-18-9-11-21;1-4(2)3/h2-3,6-7,12,18H,1,4-5,8-11H2;1H
charge 0 multiplicity 1
46 atoms
Cl -7.515512 -2.7965 0.269711
S  8.682178 0.538548 -1.430822
S  9.790616 -0.047586 0.711766
O  -2.636371 -1.196957 0.052985
O  9.600184 1.615435 1.526364
O  8.810443 -1.096234 1.473787
O  11.374583 -0.369475 0.647245
N  4.766955 -0.30654 -0.415843
N  -4.255621 0.524392 0.125666
C  0.933709 0.1383 -0.135755
C  2.296589 -0.578567 -0.2592
C  -0.249408 -0.855933 -0.092878
C  3.481653 0.405616 -0.297263
C  -1.594453 -0.134877 0.002567
C  5.983525 0.498528 -0.578616
C  7.123301 -0.420916 -1.055624
C  -3.95572 -0.778547 0.113105
C  -6.671814 -0.101071 0.229313
C  -5.598867 0.878086 0.182888
C  -4.924595 -1.842048 0.156794
C  -6.258568 -1.47856 0.213738
C  -8.027526 0.343068 0.285539
C  -5.935877 2.266736 0.195489
C  -8.324035 1.709768 0.295832
C  -7.27229 2.675504 0.250684
H  0.805602 0.831802 -0.992757
H  0.92625 0.765755 0.779516
H  2.31764 -1.198217 -1.176337
H  2.421418 -1.273384 0.598196
H  -0.14106 -1.534837 0.774912
H  -0.242291 -1.489869 -1.000252
H  3.382793 1.075872 -1.174525
H  3.447982 1.061171 0.608076
H  -1.676544 0.487073 0.91372
H  -1.789271 0.514036 -0.871622
H  4.8708 -1.083999 0.249003
H  6.306695 1.029435 0.346918
H  5.782629 1.274818 -1.341625
H  6.848943 -0.977898 -1.970618
H  7.381946 -1.160045 -0.267852
H  -4.591007 -2.880709 0.143412
H  -8.82883 -0.401841 0.32016
H  -5.113272 2.987318 0.160248
H  -9.366183 2.043192 0.338759
H  -7.516839 3.743327 0.259529
H  10.305321 1.674834 2.23827
