program: Gaussian 09
title: 000218764
version: EM64L-G09RevD.01
frameworkgroup: C1[X(C15H19ClN2O4S2)]
method: RPBEPBE
basis: SDD
operation: Freq
keyword: #p
keyword: freq=noraman
keyword: PBEPBE/SDD
title: #p freq=noraman PBEPBE/SDD
converged: YES YES NO NO
title: Mulliken charges:
elementType: Cl S S O O O O N N C C C C C C C C C C C C C C C H H H H H H H H H H H H H H H H H H H
charge: -0.061094 0.102868 0.966485 -0.259343 -0.551302 -0.495192 -0.500376 -0.281274 -0.047831 -0.416038 -0.352201 -0.263060 -0.265979 0.271327 0.413402 0.101651 -0.060720 -0.763104 -0.502663 -0.323606 -0.811720 -0.302613 -0.151354 -0.223872 0.236511 0.206837 0.217909 0.197767 0.219254 0.221240 0.273205 0.220397 0.221213 0.301716 0.313001 0.258667 0.266432 0.240213 0.239382 0.240480 0.263643 0.259541 0.380201
chargesum: 0.00000
title: Mulliken charges with hydrogens summed into heavy atoms:
elementType: Cl S S O O O O N N C C C C C C C C C C C C C C C
charge: -0.061094 0.102868 0.966485 -0.259343 -0.171102 -0.495192 -0.500376 -0.008069 -0.047831 0.027310 0.063474 0.177434 0.175631 0.271327 0.413402 0.101651 -0.060720 -0.148387 -0.243996 -0.057174 -0.091645 -0.038970 -0.151354 0.035669
polarizability: 5.75762095e+02 8.22025704e+00 2.40840411e+02 -1.90228685e+01 -1.38983341e+00 1.64538635e+02
1716.lowfreq: -6.8256 -3.8130 -0.0015 0.0010 0.0013 4.8484 8.1157 13.6492 18.3556
frequency: -1.5950 10.9974 18.3395 22.2234 30.4507 46.9048 64.5905 72.2178 94.3578 99.8717 110.4006 131.9751 137.4195 145.2321 150.0889 154.1129 170.2554 180.2151 183.1731 203.0116 205.1373 214.0299 237.7841 247.0917 272.9639 282.3994 307.1901 311.4038 345.7378 358.1056 369.9030 402.0980 427.9805 431.6395 461.2739 502.8706 520.5701 528.1311 528.6643 553.1818 596.8487 598.3474 610.1907 678.6746 683.7623 698.3420 747.7297 769.7704 771.3650 790.4643 828.2127 833.7603 862.8724 865.8117 871.6024 889.6151 918.4224 930.6807 967.4226 972.9796 985.2270 1014.0629 1031.2220 1039.0938 1046.5382 1059.1355 1066.2048 1075.0177 1076.4434 1098.3612 1109.7712 1131.4938 1155.5676 1164.7895 1180.1146 1197.2250 1244.2573 1247.1290 1263.3162 1278.5556 1282.6008 1286.4022 1288.9117 1310.6157 1330.0779 1343.8639 1380.0558 1391.5095 1392.9030 1401.1677 1407.1433 1422.5212 1443.3691 1452.6732 1470.2921 1470.4502 1476.1532 1480.4337 1484.9866 1493.7992 1501.2160 1546.0009 1605.0780 1611.3546 2875.0192 2911.8125 2954.9816 2980.9220 2990.9192 2995.8455 3005.1221 3024.1247 3048.6444 3057.5595 3058.6153 3078.3873 3098.7877 3157.9853 3167.5602 3169.4915 3179.0692 3450.6372 3461.4739
redmass: 8.8958 5.9017 8.7344 7.1102 9.3499 6.1119 3.5043 4.9508 2.2352 4.8163 3.2379 2.4608 3.4508 3.8732 3.3615 6.2016 4.0943 1.1641 1.7618 5.9878 4.4982 4.7788 3.1608 4.1940 6.7316 8.0569 5.0001 4.1796 8.7580 5.4340 6.6486 13.1424 3.3606 3.8460 4.0575 6.1805 6.2175 3.1229 16.9295 3.8382 2.4211 4.4969 2.1415 4.2804 6.2082 4.1555 1.2779 1.2687 2.0539 6.5139 14.5288 1.6577 5.8146 1.2401 1.4716 1.4143 7.6337 9.1434 1.3348 2.6126 1.7076 2.7514 3.8526 2.8710 1.5641 1.2304 1.8462 2.7273 3.2978 3.0650 1.3619 1.5051 2.0709 1.7270 1.7059 1.3373 1.5041 1.2161 1.1763 1.1071 1.3256 2.5553 1.1100 3.0720 1.5785 1.8582 1.6166 4.4229 1.8358 1.6888 2.4562 1.0781 3.0630 1.2552 1.0790 1.0450 1.0906 1.1489 1.1023 1.0891 5.2566 8.2385 6.4949 7.3499 1.0706 1.0695 1.0645 1.0381 1.0664 1.0646 1.0759 1.0900 1.1032 1.0971 1.0972 1.1045 1.0983 1.0882 1.0921 1.0929 1.0980 1.0660 1.0751
irintensity: 0.4837 0.1675 0.3625 0.5272 1.0184 0.7204 4.1626 0.8518 2.9507 11.1624 5.2140 2.2700 0.4029 11.5973 1.7123 10.9198 5.4050 2.3038 69.6442 6.1659 11.8456 38.6054 5.0322 22.2266 30.6337 6.0738 7.3144 1.3566 13.9885 1.0213 0.3693 42.5333 5.7261 40.3886 56.2351 23.1221 0.0666 5.9376 281.4460 25.3870 168.7327 19.2149 71.6521 0.0455 4.2057 1.2729 7.5469 6.2934 0.5566 10.7630 62.3279 45.3713 45.6862 18.4938 0.1739 37.2596 11.4264 76.1905 0.6706 20.1445 5.3579 77.3155 76.4170 24.4584 6.5365 46.3145 6.6740 0.7644 53.8916 1.0688 59.6541 67.1223 10.8438 26.2619 168.3366 90.7178 27.7616 4.2045 17.0971 28.3289 20.7194 34.1621 19.5837 64.4338 61.2423 245.8756 134.3426 2.0124 32.5469 34.6904 77.5001 14.1347 10.1069 34.1472 2.0980 15.7653 44.3174 42.6929 2.7105 10.7434 40.3496 136.4095 204.0516 11.7482 95.9969 44.0672 3.2615 19.8480 2.2804 20.9848 43.0319 20.8870 2.6114 13.6567 10.8437 52.7399 18.1830 0.9878 2.6721 4.0129 4.9309 102.8809 38.1146
temp: 298.150 k
press: 1.00000 atm
elementType: 17 16 16 8 8 8 8 7 7 6 6 6 6 6 6 6 6 6 6 6 6 6 6 6 1 1 1 1 1 1 1 1 1 1 1 1 1 1 1 1 1 1 1
symmnumber: 1
zpe: 842320.2 jmol-1
zpe.correction: 0.320823 hartree
zpe.thermalcorrener: 0.346899 hartree
zpe.thermalcorrenthalpy: 0.347844 hartree
zpe.thermalcorrgfe: 0.260259 hartree
zpe.sumelectzpe: -2247.592456 hartree
zpe.sumelectthermal: -2247.566379 hartree
zpe.sumelectthermalent: -2247.565435 hartree
zpe.sumelectthermalfe: -2247.653020 hartree
dipole: -2.5654 2.1223 0.6381
dipole: 3.3901
quadrupole: -199.0542 -159.9268 -169.4793
quadrupole: -6.5622 2.3528 -3.9102
quadrupole: -22.9008 16.2266 6.6742 -6.5622 2.3528 -3.9102
hfenergy: -2247.9132787 hartree
pointgroup: C01 [X(C15H19Cl1N2O4S2)]
dipole: 1.0087923 0.7199938 -0.4928508 debye
polarizability: 575.7489601|-13.5129065|234.6343711|-15.9010435|-20.8870468|170.7578098 unknown
InChI: InChI=1S/C15H18ClN2OS.HO3S/c1-11-9-15(19-7-2-5-17-6-8-20)18-14-4-3-12(16)10-13(11)14;1-4(2)3/h3-4,9-10,17H,2,5-8H2,1H3;1H
charge 0 multiplicity 1
43 atoms
Cl 8.7138 -1.67972 0.781749
S  -7.4874 -1.114221 -1.106633
S  -8.659032 -0.327963 0.929109
O  1.147676 1.172742 -0.33739
O  -10.170352 0.339226 0.079034
O  -9.153309 -1.474305 1.957886
O  -7.794004 0.916248 1.515732
N  -3.651981 0.200101 -0.300905
N  2.854649 -0.382344 0.154669
C  -1.212187 0.672863 -0.314092
C  -2.313448 -0.390126 -0.124427
C  0.179364 0.071701 -0.106232
C  -4.802807 -0.710297 -0.29315
C  5.2210 0.388231 0.064783
C  4.776804 1.719221 -0.309919
C  2.493048 0.857179 -0.190226
C  4.216308 -0.63089 0.286804
C  -6.021453 0.023729 -0.885667
C  3.406964 1.938145 -0.433251
C  6.601274 0.04887 0.221163
C  5.771344 2.832724 -0.559169
C  4.626434 -1.948782 0.657393
C  6.950359 -1.25068 0.583714
C  5.980222 -2.265777 0.807489
H  -1.288506 1.102259 -1.328911
H  -1.356735 1.502353 0.406069
H  -2.194744 -1.192168 -0.879989
H  -2.197244 -0.876267 0.8760
H  0.393036 -0.748216 -0.817758
H  0.321368 -0.323393 0.917187
H  -3.798812 1.060605 0.24182
H  -5.066797 -1.102778 0.716734
H  -4.551551 -1.585839 -0.922188
H  -5.794377 0.463287 -1.874003
H  -6.352743 0.843723 -0.213495
H  3.00279 2.914689 -0.712315
H  7.378926 0.799952 0.058802
H  6.470682 2.5722 -1.375788
H  5.257928 3.76719 -0.837665
H  6.38247 3.035513 0.340477
H  3.848679 -2.700595 0.819848
H  6.296226 -3.273503 1.091469
H  -10.907471 0.355813 0.760539
