program: Gaussian 09
title: 000218754
version: EM64L-G09RevD.01
frameworkgroup: C1[X(C13H21BrN2O4S2)]
method: RPBEPBE
basis: SDD
operation: Freq
keyword: #p
keyword: freq=noraman
keyword: PBEPBE/SDD
title: #p freq=noraman PBEPBE/SDD
converged: YES YES NO NO
title: Mulliken charges:
elementType: Br S S O O O O N N C C C C C C C C C C C C C H H H H H H H H H H H H H H H H H H H H H
charge: 0.012578 0.060117 0.998894 -0.258836 -0.565691 -0.497387 -0.490039 -0.277605 -0.048852 -0.366452 -0.394831 -0.373047 -0.368997 -0.397087 -0.287887 -0.274692 -0.745618 0.171088 -0.317039 -0.081170 -0.309409 -0.157366 0.194257 0.197102 0.218711 0.190217 0.195469 0.196276 0.204175 0.218572 0.213468 0.213125 0.270239 0.223830 0.224122 0.246004 0.219971 0.294356 0.293944 0.261488 0.260627 0.257319 0.376058
chargesum: 0.00000
title: Mulliken charges with hydrogens summed into heavy atoms:
elementType: Br S S O O O O N N C C C C C C C C C C C C C
charge: 0.012578 0.060117 0.998894 -0.258836 -0.189634 -0.497387 -0.490039 -0.007366 -0.048852 0.024907 0.014097 0.018698 0.053750 0.029506 0.160065 0.191283 -0.157319 0.171088 -0.055552 0.179457 -0.052091 -0.157366
polarizability: 5.21748662e+02 -5.60680315e+00 1.93795749e+02 -2.27637728e+01 -4.94750582e+00 1.72668676e+02
1716.lowfreq: -1.9255 0.0008 0.0015 0.0025 2.7959 8.1805 10.1533 14.3243 16.9932
frequency: 9.7261 13.8743 16.7673 25.2752 25.7710 40.0830 50.5544 66.0712 68.5198 94.7218 99.7393 110.4199 112.3051 124.9583 131.3591 144.6683 149.1471 155.9947 163.7345 182.8514 186.3121 203.6015 223.4698 245.9421 257.6222 278.1349 299.0383 300.8963 306.6755 338.1345 389.0257 409.3271 419.8647 437.4525 486.0473 508.3097 512.9668 521.7436 613.0759 616.9264 648.4637 698.0513 729.9037 736.6302 749.6353 751.9056 796.9285 813.9639 828.1108 840.3998 875.6873 911.5779 935.6864 945.3848 961.4863 964.1691 976.8246 979.0756 1004.7368 1017.9781 1051.3187 1055.5234 1055.9688 1071.8295 1078.1768 1083.8236 1108.1128 1116.8727 1125.8921 1149.0411 1152.8540 1184.0149 1219.2873 1224.5093 1248.4553 1255.1531 1262.5745 1274.6636 1279.8264 1283.5661 1287.0822 1290.4888 1294.9078 1320.3923 1324.4416 1340.5013 1350.3406 1362.4657 1377.6927 1383.3429 1433.6443 1439.2178 1452.3160 1464.5753 1465.9560 1469.5031 1475.6298 1482.2490 1488.1651 1491.4623 1540.8334 1571.8042 2877.6101 2917.2293 2957.2479 2959.9965 2967.8898 2989.6784 2994.6098 2996.4133 2998.7459 3001.1260 3017.8345 3024.0516 3040.3624 3048.5473 3063.6306 3073.3824 3154.3293 3165.3455 3186.0065 3451.3893 3476.8178
redmass: 9.0712 5.9976 6.4243 6.2067 8.8624 5.3609 5.8257 2.3646 3.3970 3.6374 2.5890 3.4871 7.7035 2.0870 3.6213 2.4766 3.1559 3.9050 3.1187 4.4051 4.8337 2.8978 4.0291 4.9597 4.5694 3.2261 7.0118 6.7195 7.0780 4.9103 4.0611 18.5627 3.7817 4.3947 3.3507 2.9192 4.1835 17.1928 1.4296 5.0391 8.3193 5.6586 1.0671 4.9341 1.1314 1.1038 1.1603 7.1740 1.4965 17.0707 1.2348 1.3947 3.9225 8.2239 5.5678 1.3281 1.2289 1.9742 4.3082 2.4215 2.8499 1.6098 2.8654 2.5185 2.2079 2.7478 2.8746 1.2827 1.3503 2.3864 1.7009 1.5037 1.3402 1.2410 1.3383 2.6161 1.2204 1.1253 1.2922 1.4590 1.2254 1.1074 1.1068 1.5225 4.0841 1.8089 1.6486 1.6183 1.6530 1.4302 1.0880 2.2001 1.2425 1.0775 1.0759 1.0811 1.0956 1.0935 1.0899 1.0899 7.3812 6.4427 1.0700 1.0689 1.0591 1.0617 1.0615 1.0599 1.0578 1.0970 1.0569 1.0866 1.1015 1.0920 1.1032 1.1044 1.1041 1.1075 1.0931 1.0896 1.0983 1.0749 1.0663
irintensity: 1.0181 0.4125 0.2567 0.9888 0.5802 1.0180 0.9280 0.1777 0.3008 1.4552 1.0669 1.7584 0.4922 1.6959 1.7036 4.3408 3.2806 4.4416 4.9988 21.8654 1.0632 88.1313 8.8871 3.4266 15.9595 31.2251 26.5344 4.2991 0.5909 0.8765 37.8956 58.2723 1.9748 13.6367 41.9543 10.9061 0.1097 186.6199 233.3694 31.1924 61.6008 3.8172 11.4166 1.7793 5.8006 2.3719 3.8147 0.4824 51.3752 125.6227 7.2414 6.8880 69.2223 78.8753 35.8619 0.0321 5.2826 5.7392 11.2774 19.8961 24.1153 44.6000 2.9943 39.8708 1.3884 8.4192 1.2163 36.3429 18.1047 5.3498 5.0363 80.1073 28.2481 14.8360 19.9451 351.8375 22.1269 3.0890 43.5867 2.7884 6.4114 0.7184 4.9745 10.4260 40.6590 78.1843 40.1014 0.6747 4.7605 100.1128 10.6100 295.6567 29.3619 0.8290 1.5564 1.3317 4.0210 0.8997 1.7913 30.3590 9.0869 100.1828 78.4777 21.0386 0.3625 1.3718 70.1135 13.6984 5.6406 0.8631 44.3384 32.8567 2.7378 19.6304 14.9343 67.9027 3.5503 86.0381 10.8639 1.8095 2.7617 42.3836 87.2157
temp: 298.150 k
press: 1.00000 atm
elementType: 35 16 16 8 8 8 8 7 7 6 6 6 6 6 6 6 6 6 6 6 6 6 1 1 1 1 1 1 1 1 1 1 1 1 1 1 1 1 1 1 1 1 1
symmnumber: 1
zpe: 868838.3 jmol-1
zpe.correction: 0.330923 hartree
zpe.thermalcorrener: 0.357977 hartree
zpe.thermalcorrenthalpy: 0.358921 hartree
zpe.thermalcorrgfe: 0.265745 hartree
zpe.sumelectzpe: -1726.038921 hartree
zpe.sumelectthermal: -1726.011867 hartree
zpe.sumelectthermalent: -1726.010923 hartree
zpe.sumelectthermalfe: -1726.104100 hartree
dipole: 2.6546 -0.3202 -2.5610
dipole: 3.7025
quadrupole: -222.2700 -151.9042 -162.4376
quadrupole: -18.0699 29.9074 -3.8904
quadrupole: -43.3994 26.9664 16.4330 -18.0699 29.9074 -3.8904
hfenergy: -1726.3698445 hartree
pointgroup: C01 [X(C13H21Br1N2O4S2)]
dipole: -1.0267607 0.0899938 -1.0293262 debye
polarizability: 520.102807|12.445455|193.9186947|30.6466903|7.0292465|174.191585 unknown
InChI: InChI=1S/C13H20BrN2OS.HO3S/c14-12-5-6-13(16-11-12)17-9-4-2-1-3-7-15-8-10-18;1-4(2)3/h5-6,11,15H,1-4,7-10H2;1H
charge 0 multiplicity 1
43 atoms
Br -10.299351 -1.490547 -0.291609
S  8.039649 1.034343 -1.102306
S  8.824886 0.016542 1.033084
O  -4.722694 0.870891 0.39003
O  8.816146 -1.793621 0.554713
O  10.335479 0.456852 1.394175
O  7.6426 0.067961 2.128323
N  4.033231 0.230103 -0.42421
N  -6.120057 -0.908497 -0.316232
C  0.26185 0.900126 0.133471
C  1.545787 0.150189 -0.286167
C  -1.024877 0.097311 -0.161413
C  2.823833 0.964757 -0.006757
C  -2.307296 0.857866 0.249016
C  -3.565744 0.043989 -0.053321
C  5.320344 0.933637 -0.319857
C  6.388938 0.135913 -1.083387
C  -5.985548 0.327731 0.229507
C  -7.086846 1.119078 0.657881
C  -8.379124 0.588518 0.507717
C  -7.378206 -1.418836 -0.460089
C  -8.521443 -0.701707 -0.060607
H  0.214172 1.873328 -0.39757
H  0.306034 1.136446 1.216705
H  1.507941 -0.092925 -1.365826
H  1.597941 -0.816993 0.257473
H  -0.9813 -0.874079 0.373588
H  -1.064883 -0.143298 -1.24402
H  2.857633 1.24294 1.075526
H  2.79253 1.915223 -0.575683
H  -2.27818 1.091423 1.330793
H  -2.361428 1.824217 -0.288319
H  4.063728 -0.735544 -0.070783
H  -3.676044 -0.174348 -1.132067
H  -3.58445 -0.917841 0.492451
H  5.662143 1.091455 0.729594
H  5.206809 1.933019 -0.781739
H  6.105852 -0.017722 -2.142194
H  6.558537 -0.861497 -0.635228
H  -6.915019 2.107804 1.089753
H  -9.255738 1.160864 0.823798
H  -7.457412 -2.416786 -0.902465
H  9.678074 -1.979688 0.078954
