program: Gaussian 09
title: 000218753
version: EM64L-G09RevD.01
frameworkgroup: C1[X(C13H19N3O4S2)]
method: RPBEPBE
basis: SDD
operation: Freq
keyword: #p
keyword: freq=noraman
keyword: PBEPBE/SDD
title: #p freq=noraman PBEPBE/SDD
converged: YES YES NO NO
title: Mulliken charges:
elementType: S S O O O O N N N C C C C C C C C C C C C C H H H H H H H H H H H H H H H H H H H
charge: 0.100725 0.970410 -0.250856 -0.558317 -0.501806 -0.494075 -0.279807 -0.039353 -0.018783 -0.391405 -0.362800 -0.365873 -0.393126 -0.290768 -0.266157 -0.763294 0.179591 -0.307680 -0.255363 -0.449615 0.365819 -0.246734 0.221952 0.191183 0.195781 0.194327 0.218261 0.199719 0.214508 0.215577 0.271200 0.227643 0.228823 0.229024 0.220414 0.308941 0.299088 0.263598 0.268079 0.271208 0.379943
chargesum: 0.00000
title: Mulliken charges with hydrogens summed into heavy atoms:
elementType: S S O O O O N N N C C C C C C C C C C C C C
charge: 0.100725 0.970410 -0.250856 -0.178374 -0.501806 -0.494075 -0.008608 -0.039353 -0.018783 0.021730 0.027308 0.052107 0.036959 0.165698 0.183281 -0.155266 0.179591 -0.044081 0.012716 -0.178407 0.365819 -0.246734
polarizability: 5.21212575e+02 1.08551531e+01 1.84344795e+02 2.49514806e+01 2.84520860e+00 1.61595303e+02
1716.lowfreq: -0.0014 -0.0011 0.0012 1.3903 3.0175 9.6513 10.8542 15.4883 17.9023
frequency: 9.6865 15.1983 17.8134 21.4044 29.5208 41.2011 52.9198 64.4616 77.9973 100.5087 106.5548 109.4985 118.0417 127.7071 133.8573 148.9075 153.3744 161.7563 177.5592 185.6357 213.5682 231.1743 243.6352 251.4757 279.9474 305.2087 311.2763 336.9614 404.2163 411.9178 414.5648 447.1722 477.4651 487.9409 518.5981 525.2570 555.2785 566.0058 608.4756 634.7720 701.0268 722.7598 735.8269 744.9288 757.2635 767.7427 824.2227 828.0892 837.3064 847.1979 932.3064 935.8674 940.2641 952.9647 978.5987 980.6357 987.0683 1014.6796 1023.6965 1054.9944 1059.7446 1063.7874 1082.3391 1107.4525 1119.0233 1133.7422 1151.2191 1157.6010 1187.7921 1208.0589 1229.1694 1234.6615 1260.1783 1267.4090 1273.0549 1287.2888 1289.2386 1292.3067 1293.4758 1301.5212 1324.0450 1334.9578 1354.2473 1364.4309 1381.2611 1384.0276 1422.1188 1453.9319 1460.1565 1465.8552 1468.0954 1473.4278 1480.1232 1486.7829 1491.9021 1529.4402 1594.4425 2176.9730 2874.1452 2916.3670 2956.8113 2959.4826 2966.7776 2992.1644 2998.8845 3004.1501 3005.8569 3024.4132 3039.6484 3051.7204 3055.5410 3078.8361 3148.5310 3164.6923 3190.4973 3454.7758 3455.8190
redmass: 7.9116 5.6647 5.8761 6.2580 8.5453 5.4051 2.7774 3.5367 3.1129 3.6412 3.2273 3.2974 3.3487 3.5111 2.5585 3.7136 5.1590 3.1437 2.8717 2.5780 4.0189 5.1486 4.8056 7.5562 8.9382 6.4264 5.8335 3.9723 13.1508 3.6517 6.5628 3.4852 4.6298 4.7924 5.8143 15.2856 5.6759 3.8828 1.2969 8.0454 4.6870 8.3395 1.0687 1.2276 5.0605 1.1126 7.4163 14.6257 1.2127 1.4710 9.0470 1.4649 8.1286 1.2428 1.9928 1.3352 3.2768 4.1457 2.4110 1.9559 1.7459 2.7145 2.2530 3.0371 1.2977 1.3327 1.5638 2.5523 1.4429 3.3270 1.2882 1.2502 1.3489 2.0789 1.1775 1.1020 1.1112 1.7871 1.2539 1.2889 2.7992 1.3948 1.6180 2.1423 1.5893 1.7892 1.0798 1.2479 2.0674 1.1348 1.0836 1.1338 1.1002 1.0961 1.0913 5.9926 6.1996 12.6248 1.0703 1.0691 1.0636 1.0607 1.0631 1.0605 1.0848 1.0571 1.0984 1.0903 1.1017 1.1040 1.0979 1.1079 1.0931 1.0906 1.0979 1.0681 1.0729
irintensity: 1.2280 0.9642 0.5916 0.9521 0.6740 0.3686 1.8334 1.1357 0.1549 1.5604 4.6122 15.6549 14.4665 1.1536 1.6981 6.9974 7.6593 10.4744 21.4867 52.1291 49.2035 6.9200 12.0016 0.1237 28.3496 11.6126 3.9466 35.3566 43.4891 3.4056 0.3897 59.2217 0.7706 11.6090 31.4407 171.1182 1.1967 6.5993 233.6644 0.6808 1.4381 22.8273 9.2314 13.0829 2.7159 1.7709 3.3581 95.6573 3.9707 51.6270 78.9481 11.9489 120.9159 4.7192 3.1762 0.2185 5.9115 27.9205 0.6951 31.0352 24.5278 35.2791 0.6524 3.0647 41.2984 31.4682 4.7578 16.3743 87.5339 18.9440 31.2122 1.1184 48.7825 294.1262 69.4518 0.2229 12.4898 17.3357 19.4858 23.0090 1.6941 40.3890 67.1777 100.8341 30.7525 49.4186 15.0823 43.5951 171.4400 4.6992 1.7452 11.7940 0.7640 7.8286 20.2680 28.9510 256.4423 70.0396 91.6733 34.2809 3.5078 2.2483 39.5073 13.3209 32.6421 38.5082 2.9484 22.0971 15.1292 39.7585 8.3622 69.9165 8.4433 2.0904 1.7581 96.6285 17.3047
temp: 298.150 k
press: 1.00000 atm
elementType: 16 16 8 8 8 8 7 7 7 6 6 6 6 6 6 6 6 6 6 6 6 6 1 1 1 1 1 1 1 1 1 1 1 1 1 1 1 1 1 1 1
symmnumber: 1
zpe: 817231.0 jmol-1
zpe.correction: 0.311267 hartree
zpe.thermalcorrener: 0.337319 hartree
zpe.thermalcorrenthalpy: 0.338263 hartree
zpe.thermalcorrgfe: 0.248080 hartree
zpe.sumelectzpe: -1766.157135 hartree
zpe.sumelectthermal: -1766.131083 hartree
zpe.sumelectthermalent: -1766.130138 hartree
zpe.sumelectthermalfe: -1766.220322 hartree
dipole: 0.1999 -0.7044 0.1729
dipole: 0.7524
quadrupole: -261.9762 -145.1765 -143.7544
quadrupole: -31.0893 4.3497 -2.8599
quadrupole: -78.3405 38.4592 39.8813 -31.0893 4.3497 -2.8599
hfenergy: -1766.4684014 hartree
pointgroup: C01 [X(C13H19N3O4S2)]
dipole: -0.0771664 -0.271502 -0.0891906 debye
polarizability: 521.7737052|-10.0305948|184.4634778|21.0351181|-0.7274741|160.9154904 unknown
InChI: InChI=1S/C13H18N3OS.HO3S/c14-10-12-4-5-13(16-11-12)17-8-3-1-2-6-15-7-9-18;1-4(2)3/h4-5,11,15H,1-3,6-9H2;1H
charge 0 multiplicity 1
41 atoms
S  7.764958 0.556415 -1.462083
S  8.872124 -0.055359 0.670441
O  -3.571928 -1.010409 0.084229
O  8.692125 1.601971 1.498991
O  7.888413 -1.104701 1.426257
O  10.453488 -0.385323 0.595212
N  3.846502 -0.248461 -0.423073
N  -5.144663 0.749656 0.246115
N  -10.008383 1.076465 0.513726
C  1.373392 -0.480714 -0.249985
C  0.026063 0.256861 -0.084869
C  2.57572 0.483117 -0.269732
C  -1.176256 -0.715404 -0.069345
C  -2.502519 0.031456 0.071295
C  5.073305 0.542447 -0.585481
C  6.195122 -0.385544 -1.086734
C  -4.878523 -0.582794 0.174239
C  -5.886583 -1.588371 0.184834
C  -7.222049 -1.17997 0.27229
C  -6.445158 1.134341 0.330658
C  -7.527919 0.214814 0.347579
C  -8.881555 0.680322 0.437981
H  1.372467 -1.068651 -1.187944
H  1.495893 -1.206729 0.581445
H  0.039786 0.847655 0.854327
H  -0.09631 0.986062 -0.912496
H  2.480739 1.180837 -1.125638
H  2.561955 1.111864 0.654975
H  -1.072229 -1.431672 0.768252
H  -1.192094 -1.31027 -1.002556
H  3.948107 -1.036448 0.229831
H  -2.563726 0.611813 1.010436
H  -2.690497 0.721815 -0.771407
H  5.412006 1.055086 0.344785
H  4.876447 1.332467 -1.335275
H  6.450133 -1.141221 -0.313786
H  5.904932 -0.923254 -2.008387
H  -5.602135 -2.641084 0.124742
H  -8.030612 -1.916582 0.283181
H  -6.632543 2.211728 0.387079
H  9.396205 1.650867 2.212789
