program: Gaussian 09
title: 000218741
version: EM64L-G09RevD.01
frameworkgroup: C1[X(C10H15N3O6S2)]
method: RPBEPBE
basis: SDD
operation: Freq
keyword: #p
keyword: freq=noraman
keyword: PBEPBE/SDD
title: #p freq=noraman PBEPBE/SDD
converged: YES YES NO NO
title: Mulliken charges:
elementType: S S O O O O O O N N N C C C C C C C C C C H H H H H H H H H H H H H H H
charge: 0.111594 0.968802 -0.242054 -0.557337 -0.498194 -0.486793 -0.211792 -0.210085 -0.280546 -0.040471 0.032617 -0.352900 -0.413792 -0.267952 -0.269427 -0.764877 0.161804 -0.289779 -0.228002 0.339297 -0.397927 0.196223 0.218152 0.239326 0.209364 0.269512 0.222368 0.231194 0.231169 0.228674 0.302982 0.306837 0.268761 0.296917 0.294526 0.381808
chargesum: 0.00000
title: Mulliken charges with hydrogens summed into heavy atoms:
elementType: S S O O O O O O N N N C C C C C C C C C C
charge: 0.111594 0.968802 -0.242054 -0.175529 -0.498194 -0.486793 -0.211792 -0.210085 -0.011034 -0.040471 0.032617 0.061475 0.034898 0.185610 0.190417 -0.155058 0.161804 -0.021019 0.068915 0.339297 -0.103401
polarizability: 4.73956900e+02 -1.22573721e+01 1.73227095e+02 1.98960985e+01 9.06804735e+00 1.54115988e+02
1716.lowfreq: -2.8872 0.0011 0.0013 0.0016 2.3397 5.5303 8.8461 15.7376 18.4915
frequency: 5.5260 15.1878 18.3781 25.7689 31.1559 51.6227 65.4900 75.1564 87.6035 99.9925 118.2675 123.3589 132.0162 142.2825 158.1824 162.4078 181.4475 190.2063 215.5708 242.4719 249.0204 279.7743 283.9622 304.2044 306.5354 353.6391 403.1641 412.6057 420.5382 451.0892 494.5419 502.2661 523.9871 528.5514 619.4873 632.0813 654.9203 676.7766 699.2223 739.2300 759.0420 767.8569 770.1200 824.6479 829.6650 846.0144 866.6619 938.9672 941.0470 954.5796 978.5444 985.0928 993.9174 1026.8265 1044.8194 1056.3410 1078.9653 1096.4652 1103.2863 1109.6863 1127.9903 1151.5835 1161.7651 1198.5994 1219.6609 1247.2160 1260.0264 1267.4298 1279.7643 1280.7376 1286.8225 1292.7620 1335.5735 1342.4638 1356.9207 1370.4473 1387.8173 1396.1459 1419.6742 1448.6621 1458.1844 1470.5131 1478.6151 1486.2854 1494.5815 1554.3797 1586.8340 2872.5024 2915.4136 2968.4989 2992.5761 3002.6874 3009.9636 3026.4852 3056.4411 3059.4349 3086.2790 3172.7217 3177.9218 3195.6363 3444.8238 3453.9283
redmass: 8.6857 6.3384 7.3924 8.7101 8.6003 5.7241 6.1121 2.8084 4.2364 2.8535 3.0678 6.4243 2.8414 2.1784 7.3484 3.6574 2.6325 3.5020 4.7322 4.4334 5.0927 7.7309 7.0338 6.9312 7.3295 6.0035 13.0464 6.7024 3.7312 3.9440 6.5343 3.1589 17.0713 4.9876 5.7192 1.4783 6.5746 6.7926 5.6778 1.1706 5.4940 6.6625 1.1526 7.3329 15.4484 1.4833 1.2098 9.1804 7.6682 1.4494 3.5803 1.6986 1.3235 3.1809 2.8554 1.2329 2.8134 2.5512 2.4727 1.3755 1.5901 2.8309 1.4351 1.3568 8.6375 1.2128 1.7949 1.2300 1.1316 1.9611 1.2963 1.1390 1.9288 2.0764 4.4395 2.0826 1.7253 2.6874 1.0963 2.5045 1.2254 1.0934 1.1016 1.0911 1.0827 8.0008 6.4595 1.0707 1.0695 1.0623 1.0725 1.0756 1.0593 1.0903 1.0993 1.1018 1.1066 1.0929 1.0896 1.0987 1.0748 1.0660
irintensity: 1.0116 0.4421 1.1894 1.2816 0.7023 0.4100 0.2152 3.3347 2.0169 0.8480 19.3645 0.4104 12.8501 3.2784 14.7476 8.9011 48.9526 32.7072 47.0805 6.3632 4.1965 30.9790 0.0000 5.2381 13.9538 10.4614 44.2806 1.9391 3.7146 79.5216 25.0276 3.1331 172.2976 1.2361 21.4656 263.7199 28.2543 12.2113 3.8645 9.1208 7.7822 3.5772 5.0400 9.4332 92.0468 43.7755 8.1234 134.6339 110.2398 11.9556 7.5215 13.5940 1.7035 16.2279 5.3077 63.3848 2.7785 12.9529 20.2653 43.6342 41.4770 10.9946 12.2078 130.0938 695.9156 4.7051 203.6819 5.3163 2.7662 123.3126 20.9530 9.7638 10.1606 21.8347 159.2165 26.5453 155.0453 39.8490 20.2126 113.3525 30.8127 2.1612 6.8959 3.5848 15.2150 28.0741 350.7373 104.1738 29.4130 2.5352 3.8513 26.8501 33.9989 24.1921 7.4531 0.9296 46.8725 0.9469 1.1306 2.1919 37.6672 65.8839
temp: 298.150 k
press: 1.00000 atm
elementType: 16 16 8 8 8 8 8 8 7 7 7 6 6 6 6 6 6 6 6 6 6 1 1 1 1 1 1 1 1 1 1 1 1 1 1 1
symmnumber: 1
zpe: 678563.8 jmol-1
zpe.correction: 0.258451 hartree
zpe.thermalcorrener: 0.282475 hartree
zpe.thermalcorrenthalpy: 0.283420 hartree
zpe.thermalcorrgfe: 0.197713 hartree
zpe.sumelectzpe: -1799.882772 hartree
zpe.sumelectthermal: -1799.858748 hartree
zpe.sumelectthermalent: -1799.857804 hartree
zpe.sumelectthermalfe: -1799.943510 hartree
dipole: -1.2826 -1.0544 0.1956
dipole: 1.6718
quadrupole: -236.2906 -135.1665 -137.3458
quadrupole: -22.9506 -5.5063 -4.3809
quadrupole: -66.6896 34.4345 32.2552 -22.9506 -5.5063 -4.3809
hfenergy: -1800.1412234 hartree
pointgroup: C01 [X(C10H15N3O6S2)]
dipole: -0.5021252 0.3524271 -0.2372614 debye
polarizability: 474.7334867|6.1046916|176.9176674|-15.9700451|-0.1144141|149.6488288 unknown
InChI: InChI=1S/C10H14N3O3S.HO3S/c14-13(15)9-2-3-10(12-8-9)16-6-1-4-11-5-7-17;1-4(2)3/h2-3,8,11H,1,4-7H2;1H
charge 0 multiplicity 1
36 atoms
S  -6.863741 -0.379523 -1.54939
S  -7.714409 -0.118689 0.749272
O  1.895932 1.007665 0.045082
O  -7.260794 -1.828691 1.326313
O  -6.737715 0.935995 1.504939
O  -9.31428 0.044971 0.898807
O  8.129958 0.322176 0.745742
O  7.461499 -1.856141 0.560891
N  -2.922733 0.430081 -0.570513
N  3.494361 -0.728775 0.150206
N  7.221195 -0.586123 0.594549
C  -1.649953 -0.300476 -0.427642
C  -0.473659 0.687127 -0.279916
C  -4.130784 -0.381693 -0.79403
C  0.857004 -0.050228 -0.128984
C  -5.279004 0.55446 -1.20286
C  3.203084 0.602264 0.180639
C  4.180288 1.627362 0.345988
C  5.517799 1.242624 0.484149
C  5.825751 -0.143067 0.452179
C  4.796689 -1.09452 0.285147
H  -1.660617 -1.004041 0.441856
H  -1.510877 -0.921284 -1.3351
H  -0.440415 1.349815 -1.162801
H  -0.631086 1.329284 0.60901
H  -3.053903 1.151108 0.152098
H  -3.920642 -1.097505 -1.611321
H  -4.442905 -0.981731 0.092688
H  1.112499 -0.653812 -1.018741
H  0.879239 -0.71378 0.754909
H  -5.041992 1.130487 -2.116906
H  -5.503318 1.278519 -0.392727
H  3.869764 2.674265 0.360586
H  6.321434 1.971679 0.614115
H  5.029021 -2.162766 0.260162
H  -7.804894 -2.021039 2.147603
