program: Gaussian 09
title: 000218730
version: EM64L-G09RevD.01
frameworkgroup: C1[X(C21H17NO3)]
method: RPBEPBE
basis: SDD
operation: Freq
keyword: #p
keyword: freq=noraman
keyword: PBEPBE/SDD
title: #p freq=noraman PBEPBE/SDD
converged: YES YES NO NO
title: Mulliken charges:
elementType: O O O N C C C C C C C C C C C C C C C C C C C C C H H H H H H H H H H H H H H H H H
charge: -0.316647 -0.221441 -0.434205 -0.084339 0.168443 0.156955 -0.018397 0.355431 -0.349098 0.505347 -0.369783 -0.254008 -0.494993 -0.380819 -0.227158 -0.410696 -0.345928 -0.369911 0.205758 0.155087 -0.306156 -0.242093 -0.235458 -0.230992 -0.524013 0.265201 0.246696 0.233337 0.253961 0.226473 0.229474 0.276197 0.248146 0.270264 0.243011 0.228668 0.228401 0.228994 0.381632 0.231590 0.230901 0.246169
chargesum: 0.00000
title: Mulliken charges with hydrogens summed into heavy atoms:
elementType: O O O N C C C C C C C C C C C C C C C C C C C C C
charge: -0.316647 -0.221441 -0.052572 -0.084339 0.168443 0.156955 -0.018397 0.355431 -0.083897 0.505347 -0.123087 -0.020670 -0.241032 -0.154346 0.002317 -0.134498 -0.097782 -0.099647 0.205758 0.155087 -0.063145 -0.013425 -0.007057 -0.001998 0.184645
polarizability: 4.04045967e+02 -5.20055520e+01 2.43891742e+02 -1.89431169e+01 -3.06129926e+01 1.77905883e+02
1716.lowfreq: -8.7277 -4.9065 -1.6934 -0.0003 0.0001 0.0007 16.5424 21.9915 29.0592
frequency: 16.3849 21.9032 29.0340 42.7117 58.3689 71.9827 84.4496 110.7502 133.7988 137.9163 158.8508 173.1868 199.8687 212.3378 221.5881 249.4440 272.1532 297.2108 299.8279 328.8446 351.3203 376.6828 403.5488 418.2604 434.9395 447.0640 476.7687 484.8364 485.5008 514.2767 540.4220 573.4605 583.7150 613.3268 614.2167 618.8287 636.1680 681.5406 700.6309 703.8994 726.8959 731.4772 756.5843 757.5077 784.7810 805.7281 816.4003 839.2826 859.2708 871.3637 875.8441 916.1073 943.2574 946.2911 953.2779 955.4785 982.0412 985.1515 987.6194 989.9181 990.3887 1001.6904 1024.4999 1043.5992 1081.1727 1090.4142 1109.4079 1117.0513 1148.7772 1153.1042 1161.5014 1172.2073 1172.9402 1185.0218 1190.2234 1194.7581 1238.8486 1251.1062 1261.9040 1294.1855 1311.0042 1315.4583 1346.2594 1371.1923 1385.9795 1406.3463 1426.2903 1434.5812 1438.9932 1458.1000 1466.2290 1470.4531 1476.3072 1477.5713 1501.0822 1537.9738 1561.5764 1579.0886 1588.2638 1592.7605 1608.5669 1612.4293 1631.6863 2938.6235 2972.8537 3065.7898 3124.9393 3125.9877 3133.1341 3133.8144 3140.4393 3145.2842 3149.5015 3150.6099 3153.0425 3156.0214 3166.6278 3167.9846 3174.0632 3519.8817
redmass: 5.0143 5.7915 5.9212 4.7763 4.7529 4.3447 3.8965 4.9442 5.7953 4.8783 4.7130 3.2055 5.2040 4.3273 1.2850 5.7369 3.4879 6.1041 5.5691 4.6045 6.4354 4.1599 2.8518 4.7410 4.3902 2.9657 5.8238 2.8421 1.3544 5.1092 4.5522 5.0913 4.6050 5.6069 4.5584 6.6333 6.3551 4.5410 1.6096 5.6233 3.6094 4.9000 1.8699 2.4866 3.0176 2.7149 1.3688 4.3476 1.2474 1.6402 1.5227 5.2275 2.3381 1.8013 1.4374 1.3400 1.5932 1.3664 1.4121 5.9353 8.4688 1.3339 2.2164 2.1672 1.6503 2.4442 2.1324 1.2552 1.4454 2.2785 1.4046 1.0636 1.0642 1.1579 1.9265 2.0953 1.8513 1.8718 1.9998 2.2965 2.1253 1.3760 2.3005 6.0801 9.2390 3.1549 2.3800 2.2941 1.2017 2.6133 1.0510 1.6835 1.6072 2.2284 3.0807 10.4333 6.7483 7.6347 6.2483 6.5111 6.0719 6.4530 6.7569 1.0861 1.0321 1.1047 1.0848 1.0856 1.1007 1.0880 1.0893 1.0927 1.0919 1.0943 1.0878 1.0960 1.1012 1.1003 1.0963 1.0646
irintensity: 0.1503 1.6177 2.9402 2.4988 1.6177 0.2687 1.4253 6.6481 0.1808 0.7306 0.5821 0.8325 1.8786 0.5038 0.1939 4.9445 12.0259 3.9505 3.6455 4.7805 3.3347 4.2448 0.2118 2.9923 2.1842 11.2887 21.0081 37.6301 102.5470 11.8230 18.2252 4.3574 3.3681 2.5129 4.2935 8.3965 30.0245 10.3772 80.3726 2.0477 11.9039 15.9900 53.5863 37.9099 14.3582 9.8945 33.4743 41.8973 1.2663 3.3483 16.0910 45.3513 16.3154 14.7253 5.0373 1.4013 21.9378 9.6986 0.3180 1.0880 59.0175 0.8393 2.6430 7.6484 14.5402 46.6099 101.4023 0.1714 1.0405 6.5237 46.3526 1.3191 6.3828 20.2024 147.0553 17.2622 81.3114 45.6327 260.2765 157.1664 180.8209 16.6378 6.3079 12.3775 2.9206 6.1128 12.8082 28.4028 18.5425 13.1390 15.4694 19.2403 60.3675 15.6146 193.7644 150.3095 119.0067 195.3669 16.7732 40.8222 13.7041 85.2614 13.7563 44.6580 69.6252 37.4762 0.5956 4.6396 22.7795 3.9634 4.5168 19.8873 4.1081 14.8537 6.4251 19.5177 25.8891 28.7216 5.8346 93.1751
temp: 298.150 k
press: 1.00000 atm
elementType: 8 8 8 7 6 6 6 6 6 6 6 6 6 6 6 6 6 6 6 6 6 6 6 6 6 1 1 1 1 1 1 1 1 1 1 1 1 1 1 1 1 1
symmnumber: 1
zpe: 846740.1 jmol-1
zpe.correction: 0.322506 hartree
zpe.thermalcorrener: 0.344400 hartree
zpe.thermalcorrenthalpy: 0.345344 hartree
zpe.thermalcorrgfe: 0.269058 hartree
zpe.sumelectzpe: -1089.094353 hartree
zpe.sumelectthermal: -1089.072459 hartree
zpe.sumelectthermalent: -1089.071515 hartree
zpe.sumelectthermalfe: -1089.147801 hartree
dipole: -5.1799 0.2198 0.8847
dipole: 5.2595
quadrupole: -125.3805 -134.6170 -144.8541
quadrupole: -22.9851 21.6545 -1.5256
quadrupole: 9.5700 0.3336 -9.9036 -22.9851 21.6545 -1.5256
hfenergy: -1089.4168591 hartree
pointgroup: C01 [X(C21H17N1O3)]
dipole: 2.0089665 -0.2430103 0.4322246 debye
polarizability: 400.0486198|-62.5675266|221.6591572|15.1997536|40.3324344|204.1358156 unknown
InChI: InChI=1S/C21H17NO3/c1-25-20-12-11-15(13-19(20)23)14-22-18-10-6-5-9-17(18)21(24)16-7-3-2-4-8-16/h2-14,23H,1H3
charge 0 multiplicity 1
42 atoms
O  5.674307 0.022464 0.006204
O  -3.585344 -0.841451 -2.242401
O  4.844251 0.950574 2.37562
N  -0.780978 0.963836 -0.022025
C  -3.188544 0.604798 -0.370533
C  -2.119545 1.365864 0.206582
C  -2.967096 -0.669305 -1.144789
C  -2.081541 -1.750705 -0.600279
C  -4.515692 1.093047 -0.285035
C  1.569398 0.825274 0.598106
C  -2.429503 2.591793 0.86678
C  -4.812389 2.295121 0.39007
C  2.539203 1.030635 1.62022
C  0.160084 1.130476 0.875167
C  -3.759753 3.045067 0.966569
C  1.978896 0.331038 -0.670418
C  -1.826157 -1.882546 0.789956
C  -1.554611 -2.716161 -1.499312
C  4.289887 0.255912 0.096844
C  3.890006 0.749218 1.374088
C  3.335208 0.046649 -0.922603
C  -1.053856 -2.960181 1.272293
C  -0.767131 -3.781115 -1.019448
C  -0.515362 -3.906489 0.368933
C  6.202634 -0.480879 -1.26518
H  -5.309318 0.511335 -0.765515
H  -1.610491 3.211188 1.25004
H  -5.845415 2.652528 0.45171
H  2.251475 1.408945 2.607166
H  -0.064475 1.490487 1.902939
H  -3.973251 3.99358 1.472352
H  1.214899 0.174462 -1.437389
H  -2.251259 -1.155427 1.49069
H  -1.783078 -2.612153 -2.565317
H  3.639119 -0.334083 -1.902427
H  -0.870411 -3.063709 2.347422
H  -0.354593 -4.516538 -1.719163
H  0.091645 -4.738468 0.743934
H  5.73644 0.698981 2.016771
H  6.007448 0.237316 -2.083579
H  5.760052 -1.463906 -1.513109
H  7.285941 -0.586376 -1.109936
