program: Gaussian 09
title: 000218720
version: EM64L-G09RevD.01
frameworkgroup: C1[X(C18H30N2O2)]
method: RPBEPBE
basis: SDD
operation: Freq
keyword: #p
keyword: freq=noraman
keyword: PBEPBE/SDD
title: #p freq=noraman PBEPBE/SDD
converged: YES YES NO NO
title: Mulliken charges:
elementType: O O N N C C C C C C C C C C C C C C C C C C H H H H H H H H H H H H H H H H H H H H H H H H H H H H H H
charge: -0.266650 -0.266490 -0.173611 -0.444395 -0.360288 -0.347552 -0.404122 -0.355211 -0.310785 -0.477812 -0.329684 -0.316694 -0.694458 0.141951 -0.671259 -0.668411 0.348199 0.486427 -0.362545 -0.338717 -0.439594 -0.362385 0.188069 0.187426 0.189781 0.189988 0.212625 0.213046 0.195088 0.194840 0.204363 0.204830 0.240161 0.240816 0.200474 0.231735 0.198213 0.207461 0.210280 0.210337 0.216225 0.220917 0.210479 0.219175 0.222410 0.216079 0.215524 0.351355 0.247978 0.247467 0.223988 0.302958
chargesum: 0.00000
title: Mulliken charges with hydrogens summed into heavy atoms:
elementType: O O N N C C C C C C C C C C C C C C C C C C
charge: -0.266650 -0.266490 -0.173611 -0.093040 0.015207 0.032216 0.021549 0.034717 0.098408 0.003165 0.102525 0.088979 -0.057616 0.141951 -0.020687 -0.014399 0.348199 0.486427 -0.114567 -0.091250 -0.215606 -0.059427
polarizability: 3.39017605e+02 -1.06813159e+01 2.03258829e+02 -6.25379761e-01 -8.03892183e+00 1.54822506e+02
1716.lowfreq: -23.4716 -6.9853 -0.0014 0.0010 0.0018 2.2441 4.1417 15.2157 27.1548
frequency: -17.5823 14.7095 27.1505 30.5514 42.8327 47.3933 54.6417 74.2155 86.2878 88.5426 93.8851 105.6202 107.9549 128.3503 151.2612 163.8825 178.1869 199.3937 204.9389 223.4045 225.8771 258.2404 274.9279 289.0029 320.7299 333.8813 376.5147 394.9287 408.2848 415.1779 420.6892 448.2329 488.8674 505.0942 523.5066 533.9853 577.5144 630.6847 646.9652 724.1810 724.4215 749.5294 754.8942 782.9822 796.6655 802.7170 804.9480 815.2493 838.4286 845.2077 881.7288 888.8088 892.3213 907.2951 934.2375 944.3165 972.4655 973.2889 987.3087 989.4608 995.4489 1000.8463 1013.7162 1048.4233 1064.5832 1072.3487 1074.2933 1085.8014 1087.7014 1110.7770 1118.8567 1126.6179 1149.8141 1157.0401 1178.7275 1186.7999 1196.0842 1202.5706 1215.3681 1237.1235 1246.8271 1247.5281 1259.5238 1279.6033 1280.4075 1289.3830 1291.6679 1292.1156 1294.6409 1308.8899 1328.4053 1340.6732 1356.0162 1363.1026 1370.8279 1371.8034 1386.7033 1389.4197 1392.3497 1393.1446 1422.9988 1448.9966 1463.3951 1465.2717 1466.6008 1468.5788 1470.9062 1474.2870 1477.0879 1477.9756 1478.9324 1483.5323 1485.0148 1488.8704 1490.9246 1500.0008 1516.7779 1587.3508 1619.3353 1629.7591 2889.9911 2897.5721 2942.7380 2953.7026 2954.2333 2958.1887 2968.5947 2972.9393 2985.8404 2986.1949 2990.5182 2992.4196 2999.0827 3006.7848 3029.1000 3031.8234 3042.6198 3046.4068 3060.4203 3069.8227 3071.8193 3080.2995 3082.7250 3086.8619 3090.6950 3120.5744 3157.8431 3165.2634 3184.1703 3273.7075
redmass: 1.7703 3.4599 3.7535 4.1234 3.0569 3.5382 3.4940 3.5836 2.6934 2.3908 3.1335 1.8179 2.6927 2.9711 2.0538 3.2262 2.6741 2.7955 1.8328 1.9957 1.1277 2.7331 3.2599 1.9956 3.8465 2.9077 6.2443 3.3851 3.2745 3.0801 3.7392 2.7113 3.8752 3.8248 2.6552 3.7840 3.5117 7.0503 5.1529 1.4017 2.0351 1.1019 2.6359 3.8130 1.1512 1.4090 1.1706 1.3071 1.5338 4.3892 1.3793 1.8481 1.1985 1.5662 5.3381 1.3604 7.6060 1.3213 1.8751 1.1370 2.3699 2.6139 3.7274 3.1000 2.5921 2.6577 1.9638 2.0816 2.0480 1.9411 1.3452 2.5814 1.4591 1.7510 1.2595 2.7524 1.5236 2.3575 2.7409 1.2902 1.2959 1.3799 2.2426 1.0775 1.2021 1.1360 1.1879 1.1281 1.2718 1.3791 1.3795 1.4449 1.6437 1.3358 2.6600 1.6000 1.6458 1.2174 1.2328 1.2321 3.8281 1.0820 1.0714 1.0726 1.0531 1.0626 1.0803 1.0634 1.0428 1.0957 1.0601 1.0709 1.1237 1.1608 1.1040 1.7206 2.5789 6.0250 8.0034 6.3187 1.0717 1.0704 1.0551 1.0588 1.0664 1.0588 1.0591 1.0364 1.0359 1.0359 1.0979 1.0591 1.1055 1.1022 1.0901 1.1046 1.0889 1.0935 1.1049 1.1008 1.0993 1.0987 1.0982 1.1004 1.1006 1.0895 1.0889 1.0948 1.0955 1.0767
irintensity: 0.3351 0.2029 0.2179 0.4061 0.1061 0.7668 1.0320 3.2479 0.8947 2.1695 2.8977 0.0474 0.7532 1.3250 2.2063 0.8056 1.2350 0.8751 0.3376 2.9658 0.0729 1.3625 9.2477 1.9439 1.1476 0.6628 0.2917 0.1523 1.9950 0.1214 7.2484 1.4111 8.6930 4.3274 24.0028 39.5137 0.9468 3.2978 1.9771 9.5024 2.7187 0.4392 6.6816 32.2864 4.7168 2.3155 6.3181 9.6664 57.0344 4.4397 38.9107 6.9628 2.5302 38.1614 7.7405 3.9534 75.9586 4.0325 11.8911 0.3140 12.5454 9.9921 4.1734 23.1465 34.2874 13.0202 26.1620 5.8752 4.7172 19.5445 10.9105 11.9632 1.2236 12.7665 73.8455 26.7391 0.0137 26.1238 295.4471 8.7937 0.0807 20.1909 47.7456 0.0451 11.7925 0.0440 18.2300 1.4191 1.5724 4.7214 2.5578 1.4557 0.0487 4.2040 12.8374 23.4749 18.9055 12.7263 18.5732 20.2344 42.3331 7.7435 0.0462 0.2017 8.5263 2.1951 9.7944 25.3478 12.3347 8.5927 8.1706 10.6280 39.8861 30.0780 14.0153 4.5012 790.8113 15.7044 239.0186 16.0276 39.5598 162.5423 28.8088 3.3201 56.7475 10.8543 91.2402 38.9792 27.2677 16.8946 1.0802 42.3129 26.4054 0.0019 9.9935 34.2301 9.3987 14.4005 66.4233 108.6917 54.2942 33.4583 55.5921 72.6385 37.4457 21.2358 15.3076 6.6128 7.4681 317.3693
temp: 298.150 k
press: 1.00000 atm
elementType: 8 8 7 7 6 6 6 6 6 6 6 6 6 6 6 6 6 6 6 6 6 6 1 1 1 1 1 1 1 1 1 1 1 1 1 1 1 1 1 1 1 1 1 1 1 1 1 1 1 1 1 1
symmnumber: 1
zpe: 1183838.2 jmol-1
zpe.correction: 0.450900 hartree
zpe.thermalcorrener: 0.475547 hartree
zpe.thermalcorrenthalpy: 0.476491 hartree
zpe.thermalcorrgfe: 0.393263 hartree
zpe.sumelectzpe: -962.135398 hartree
zpe.sumelectthermal: -962.110751 hartree
zpe.sumelectthermalent: -962.109806 hartree
zpe.sumelectthermalfe: -962.193035 hartree
dipole: -1.7955 -2.3513 0.2231
dipole: 2.9668
quadrupole: -94.5149 -143.8534 -135.5340
quadrupole: 14.9084 -2.3363 1.9677
quadrupole: 30.1192 -19.2193 -10.8999 14.9084 -2.3363 1.9677
hfenergy: -962.5862977 hartree
pointgroup: C01[X(C18H30N2O2)]
dipole: -0.7435816 -0.2779406 -0.8557481 debye
polarizability: 337.733253|1.3122577|159.8564625|-17.235045|16.6733501|199.5092251 unknown
InChI: InChI=1S/C18H30N2O2/c1-4-7-8-9-14-22-17-12-10-16(11-13-17)19-18(21)15-20(5-2)6-3/h10-13,19H,4-9,14-15H2,1-3H3
charge 0 multiplicity 1
52 atoms
O  2.54469 -0.025964 -0.776519
O  -2.965578 1.309723 2.874173
N  -5.555665 0.385356 0.398807
N  -2.903934 0.350154 0.709724
C  6.170933 0.554335 0.260042
C  7.514489 0.325855 -0.46873
C  4.949163 0.156676 -0.599811
C  8.744123 0.713498 0.383833
C  3.62636 0.401094 0.129329
C  -5.064943 0.63964 1.779412
C  -5.823632 1.666855 -0.32719
C  -6.694769 -0.578137 0.338807
C  10.08193 0.489014 -0.353745
C  -3.528935 0.818445 1.84718
C  -5.802234 1.517927 -1.859275
C  -6.262849 -2.032441 0.601377
C  1.221959 0.108197 -0.319678
C  -1.519112 0.289908 0.404805
C  0.217474 -0.32297 -1.222174
C  0.849863 0.630265 0.943433
C  -1.136678 -0.232311 -0.862592
C  -0.512083 0.721562 1.305389
H  6.166124 -0.026996 1.205889
H  6.091619 1.623178 0.549886
H  7.524207 0.910767 -1.411994
H  7.595458 -0.741073 -0.763863
H  4.947842 0.73222 -1.54544
H  5.012622 -0.913615 -0.87532
H  8.735726 0.125363 1.324322
H  8.659379 1.778442 0.682534
H  3.502029 1.476579 0.377233
H  3.576847 -0.185995 1.070891
H  -5.522951 1.536912 2.248539
H  -5.313803 -0.219147 2.429464
H  -6.794694 2.109915 0.001188
H  -5.032493 2.380181 -0.029769
H  -7.502558 -0.28426 1.052072
H  -7.130674 -0.516335 -0.673961
H  10.128506 1.090185 -1.281399
H  10.204987 -0.573428 -0.637037
H  10.944857 0.772672 0.276405
H  -5.953647 2.503462 -2.33628
H  -6.596764 0.845428 -2.22875
H  -4.829328 1.117518 -2.196226
H  -5.515458 -2.354253 -0.144996
H  -5.81778 -2.160137 1.604597
H  -7.1358 -2.70773 0.537028
H  -3.603679 0.018075 0.017302
H  0.520541 -0.724054 -2.194025
H  1.60548 0.969832 1.65802
H  -1.906513 -0.571267 -1.567149
H  -0.807153 1.123578 2.277243
