program: Gaussian 09
title: 000218716
version: EM64L-G09RevD.01
frameworkgroup: C1[X(C17H28N2O2)]
method: RPBEPBE
basis: SDD
operation: Freq
keyword: #p
keyword: freq=noraman
keyword: PBEPBE/SDD
title: #p freq=noraman PBEPBE/SDD
converged: YES YES NO NO
title: Mulliken charges:
elementType: O O N N C C C C C C C C C C C C C C C C C H H H H H H H H H H H H H H H H H H H H H H H H H H H H
charge: -0.264447 -0.262877 -0.174230 -0.444006 -0.340204 -0.397235 -0.474128 -0.314828 -0.328182 -0.350948 -0.305448 0.135643 -0.668996 -0.672395 -0.693557 0.492212 0.353713 -0.470730 -0.334641 -0.322879 -0.385310 0.185081 0.185263 0.211909 0.212011 0.240394 0.239111 0.197981 0.206799 0.200256 0.232615 0.197701 0.197926 0.201156 0.201346 0.221997 0.215885 0.215624 0.218663 0.210434 0.221090 0.209528 0.209477 0.218384 0.351039 0.220509 0.306621 0.245634 0.249041
chargesum: 0.00000
title: Mulliken charges with hydrogens summed into heavy atoms:
elementType: O O N N C C C C C C C C C C C C C C C C C
charge: -0.264447 -0.262877 -0.174230 -0.092968 0.030141 0.026685 0.005377 0.089952 0.104689 0.044678 0.097053 0.135643 -0.015490 -0.022208 -0.056168 0.492212 0.353713 -0.250221 -0.028020 -0.077245 -0.136269
polarizability: 3.20995668e+02 -7.89161719e+00 1.96528280e+02 -2.66854285e+00 -4.92248437e+00 1.45442411e+02
1716.lowfreq: -7.0835 0.0002 0.0010 0.0019 3.4907 5.7287 16.0872 30.0995 34.8923
frequency: 14.3180 30.0372 34.8841 38.2273 54.8673 60.7361 65.8710 73.3057 89.1748 94.6553 104.8222 130.2049 134.2779 148.6059 164.2737 193.1229 200.9655 214.4874 227.6118 241.6393 271.8410 292.7282 305.5292 329.3554 351.6619 377.2133 404.3116 415.4333 430.2530 447.6865 467.1998 510.7412 524.9374 529.5782 578.7300 628.9448 654.1025 724.3576 731.9388 752.3500 773.5196 778.1811 796.4083 800.7980 805.0510 842.6891 853.6431 858.0786 878.7521 891.0183 905.5306 925.8884 937.0277 969.6340 977.8916 986.9397 988.2002 996.1198 1001.2850 1019.2068 1064.9143 1072.6604 1074.3363 1077.1380 1088.0922 1110.8473 1119.9834 1127.1725 1146.6383 1156.6347 1178.1717 1183.6026 1200.8329 1202.6933 1214.3719 1245.6294 1252.3609 1261.9650 1264.1382 1279.1415 1283.1681 1289.1654 1292.1240 1304.9627 1319.7080 1328.8725 1355.5046 1363.7277 1367.1893 1371.4940 1385.6131 1390.6257 1391.8326 1395.3627 1426.1981 1449.3337 1467.8767 1468.0929 1468.6208 1469.4782 1475.3249 1476.1286 1477.3342 1479.8228 1484.0015 1484.2569 1489.8354 1491.1487 1497.6351 1516.6073 1584.9089 1620.1953 1630.9283 2889.2856 2895.8287 2938.5863 2951.5350 2954.9374 2971.5626 2972.9678 2986.0218 2986.5083 2994.0117 2994.4739 2995.9003 3026.0000 3029.0998 3043.6070 3046.1970 3060.1152 3070.0675 3072.8896 3080.4916 3082.8154 3086.3731 3090.5749 3117.9144 3158.2345 3162.6176 3186.2527 3277.8578
redmass: 3.9028 3.7525 3.8074 2.8919 3.1874 2.0338 2.9000 3.4453 2.2142 2.6326 3.7678 2.4470 2.0926 2.4185 4.2299 2.0185 5.0743 1.4329 1.1180 2.1408 2.5644 1.9075 4.9928 2.5270 3.7157 6.2105 3.2738 3.0658 3.7284 2.7451 3.8775 3.6715 2.8271 3.6500 3.5128 6.8042 5.1278 3.6675 1.0717 2.8468 1.1193 3.6729 1.1509 1.3505 1.3814 4.0338 1.4697 1.1801 1.3192 1.9504 1.6989 1.3848 5.0724 1.1442 6.2018 1.6021 1.4805 2.3772 2.6237 3.6451 2.5815 2.4350 1.9043 2.4853 2.1370 1.9142 1.3358 2.4486 1.4361 1.7765 1.3106 2.5997 2.3306 1.4635 2.5396 1.3897 1.2897 1.2467 2.4555 1.1898 1.0598 1.1886 1.1158 1.3267 1.3589 1.3804 1.5904 1.3432 3.2013 1.3588 1.7560 1.2584 1.2335 1.2302 3.9644 1.0830 1.0683 1.0581 1.0809 1.0661 1.0697 1.0784 1.0506 1.0583 1.1013 1.0872 1.1919 1.1019 1.6001 2.6241 6.2004 7.6852 6.4656 1.0716 1.0707 1.0549 1.0668 1.0587 1.0557 1.0399 1.0358 1.0358 1.0622 1.1020 1.1000 1.1032 1.0899 1.0891 1.0930 1.1045 1.1012 1.0992 1.0985 1.0982 1.1002 1.1005 1.0895 1.0901 1.0936 1.0960 1.0766
irintensity: 0.0313 0.2104 0.4077 0.4676 0.7986 0.4097 0.1892 2.1676 0.9918 2.1865 2.3014 0.6470 0.4376 3.3112 2.6237 0.7672 1.0952 0.1709 0.0025 1.7069 9.5627 1.5326 3.9487 0.8943 3.2054 0.2926 1.1271 0.0072 8.0430 1.5981 4.8302 2.5857 24.9166 39.9828 0.6513 0.6096 1.7604 0.3209 11.1904 5.7107 1.4815 27.1449 4.7188 15.7251 1.7575 6.0010 66.2737 0.0190 37.9227 18.8437 21.9887 12.4760 3.3421 0.6667 82.4308 11.5387 1.3663 15.9699 7.0045 9.3998 32.4420 30.8718 21.8068 1.8452 5.9560 20.7613 25.4620 6.7097 0.4140 13.6314 80.5279 14.8658 32.8334 0.4946 271.0559 21.5657 5.6727 0.3324 61.6420 11.1196 0.0830 17.3580 0.9471 2.9297 0.5626 1.5866 1.2978 5.8765 23.6976 11.1364 61.4419 30.7727 18.2061 21.5665 8.0872 7.4369 0.5199 9.0248 3.2611 2.4238 16.8665 36.7271 16.9949 9.4507 6.5045 23.8511 20.1773 31.6593 5.2739 718.4168 60.9724 263.1400 5.7305 26.4206 172.4831 33.7667 58.0946 17.9934 61.0769 27.6285 26.2708 18.3010 39.6433 32.5211 0.1492 13.7249 9.7585 7.4570 15.5561 31.6926 120.8783 54.4102 32.7707 53.7433 74.0626 37.2980 23.6818 6.1537 14.0194 6.1950 298.3509
temp: 298.150 k
press: 1.00000 atm
elementType: 8 8 7 7 6 6 6 6 6 6 6 6 6 6 6 6 6 6 6 6 6 1 1 1 1 1 1 1 1 1 1 1 1 1 1 1 1 1 1 1 1 1 1 1 1 1 1 1 1
symmnumber: 1
zpe: 1111163.2 jmol-1
zpe.correction: 0.423220 hartree
zpe.thermalcorrener: 0.447222 hartree
zpe.thermalcorrenthalpy: 0.448166 hartree
zpe.thermalcorrgfe: 0.366392 hartree
zpe.sumelectzpe: -922.911709 hartree
zpe.sumelectthermal: -922.887707 hartree
zpe.sumelectthermalent: -922.886763 hartree
zpe.sumelectthermalfe: -922.968536 hartree
dipole: -0.8673 -5.6650 0.4001
dipole: 5.7449
quadrupole: -98.7234 -137.3401 -128.8590
quadrupole: 10.7228 -0.6420 0.9620
quadrupole: 22.9174 -15.6992 -7.2182 10.7228 -0.6420 0.9620
hfenergy: -923.3349287 hartree
pointgroup: C01 [X(C17H28N2O2)]
dipole: 0.3925605 2.1766215 0.4656864 debye
polarizability: 320.5329451|-9.3335296|194.236353|-6.3611867|12.5634452|148.1970604 unknown
InChI: InChI=1S/C17H28N2O2/c1-4-7-8-13-21-16-11-9-15(10-12-16)18-17(20)14-19(5-2)6-3/h9-12,18H,4-8,13-14H2,1-3H3
charge 0 multiplicity 1
49 atoms
O  -3.174006 -0.926485 -0.286048
O  3.224725 -2.664143 -0.967762
N  4.912735 0.571532 -0.37711
N  2.473874 -0.517396 -0.302534
C  -6.460834 0.910976 0.328246
C  -5.470149 -0.226175 -0.011405
C  4.866404 -0.914362 -0.427343
C  5.964382 1.101007 0.541505
C  4.981779 1.155794 -1.753739
C  -7.937104 0.458103 0.253912
C  -4.012243 0.23105 0.071971
C  3.431174 -1.463289 -0.610426
C  5.604522 0.926817 2.028333
C  4.511197 2.619848 -1.821692
C  -8.9306 1.591862 0.586502
C  1.059182 -0.634342 -0.305719
C  -1.778946 -0.753783 -0.272263
C  0.291478 0.505066 0.042476
C  0.388724 -1.84501 -0.641729
C  -1.118535 0.4547 0.062448
C  -1.015427 -1.894689 -0.622763
H  -6.251354 1.298748 1.347423
H  -6.307034 1.761966 -0.368144
H  -5.617586 -1.076811 0.681428
H  -5.666206 -0.606411 -1.0324
H  5.248734 -1.331233 0.522334
H  5.490391 -1.345586 -1.239745
H  6.953198 0.626861 0.329409
H  6.079971 2.178689 0.329937
H  6.014732 1.066439 -2.169102
H  4.326395 0.542574 -2.399995
H  -8.146252 0.067083 -0.762434
H  -8.092484 -0.389713 0.951413
H  -3.817491 1.06645 -0.634111
H  -3.76083 0.571268 1.099266
H  4.65731 1.445079 2.259518
H  5.487932 -0.135769 2.308196
H  6.401415 1.351812 2.665932
H  3.472777 2.711428 -1.45585
H  5.146949 3.295471 -1.221995
H  4.541468 2.977136 -2.8672
H  -8.763346 1.979704 1.609218
H  -8.815913 2.438865 -0.116127
H  -9.977491 1.242306 0.525475
H  2.918834 0.388107 -0.055551
H  0.798234 1.442667 0.303967
H  0.980364 -2.722567 -0.911073
H  -1.679797 1.352173 0.337425
H  -1.544351 -2.81822 -0.877878
