program: Gaussian 09
title: 000218659
version: EM64L-G09RevD.01
frameworkgroup: C1[X(C11H16N4O3)]
method: RPBEPBE
basis: SDD
operation: Freq
keyword: #p
keyword: freq=noraman
keyword: PBEPBE/SDD
title: #p freq=noraman PBEPBE/SDD
converged: NO YES NO NO
title: Mulliken charges:
elementType: O O O N N N N C C C C C C C C C C C H H H H H H H H H H H H H H H H
charge: -0.437873 -0.265801 -0.266053 -0.163914 -0.151751 -0.225271 -0.087535 0.292521 -0.439478 0.101561 0.071311 -0.699901 -0.739514 -0.223237 0.193205 0.211519 -0.610990 -0.599464 0.285962 0.222317 0.234779 0.199510 0.250199 0.207417 0.232198 0.250899 0.280072 0.339967 0.271413 0.246436 0.248404 0.269173 0.252109 0.249808
chargesum: 0.00000
title: Mulliken charges with hydrogens summed into heavy atoms:
elementType: O O O N N N N C C C C C C C C C C C
charge: -0.097906 -0.265801 -0.266053 -0.163914 -0.151751 -0.225271 -0.087535 0.292521 0.068801 0.101561 0.071311 -0.015413 -0.049000 0.056835 0.193205 0.211519 0.155264 0.171625
polarizability: 2.04287534e+02 -2.12138376e+00 1.68773054e+02 -1.69028317e+01 -8.00827162e-01 9.85336544e+01
1716.lowfreq: -6.7791 -0.0008 -0.0008 -0.0003 3.4839 12.6057 32.3085 37.0369 59.9394
frequency: 32.1794 37.0042 59.9347 81.2434 93.7584 105.4918 118.0070 145.8818 164.7150 178.5745 186.5611 249.9552 267.4477 281.6967 294.6503 299.3810 304.3955 321.4608 349.1893 371.9220 379.2043 386.2408 408.3731 426.6616 430.9545 465.4251 505.5306 552.9053 608.5497 657.9409 669.8791 704.5098 737.6497 745.9053 748.5943 783.4450 812.5792 875.5157 881.4108 910.0276 931.0848 955.7382 968.7061 1001.1728 1011.0604 1047.9028 1095.3998 1128.5607 1129.5279 1131.5698 1165.5410 1190.0487 1215.8631 1219.4885 1227.8533 1253.5883 1268.5863 1294.7656 1298.8944 1334.3748 1360.7048 1379.0501 1384.9091 1398.4239 1409.4366 1423.1799 1426.5191 1450.5577 1458.9297 1470.8304 1471.5042 1473.6077 1475.0765 1478.0567 1479.0811 1491.0386 1503.2117 1571.7448 1614.1128 1648.0381 2976.8196 2995.8236 3008.4316 3013.6701 3020.1709 3067.1175 3091.7796 3093.8617 3098.1060 3099.1600 3105.8272 3107.5101 3139.7743 3140.8573 3244.3938 3536.0670
redmass: 3.5057 5.0677 4.0743 1.0414 3.0289 1.4224 3.2652 3.9318 6.3585 1.3723 1.9484 2.1034 3.5628 1.7519 2.9303 1.9596 1.5316 2.4309 3.0567 6.1576 4.0483 4.5174 3.1311 3.0302 7.6278 4.0610 4.1881 6.2268 5.0643 6.4196 8.1079 10.8919 6.2301 5.6437 5.1523 5.5472 1.4080 2.7713 1.9819 3.6753 1.4791 4.8246 1.8644 1.3581 2.7822 3.1849 1.5503 1.9121 1.3252 1.3021 2.0789 3.6412 2.7338 2.5306 2.5961 3.4703 3.7279 1.9800 3.7717 2.4159 2.9503 1.2827 1.5915 1.3101 1.6476 1.5051 1.2798 1.2039 1.2345 1.1189 1.0578 1.1008 1.1414 1.0427 1.0628 1.0559 2.5127 8.1530 10.7310 9.7544 1.0368 1.0359 1.0335 1.0329 1.0599 1.0988 1.0992 1.1031 1.1026 1.1011 1.1020 1.1004 1.1013 1.1024 1.0986 1.0657
irintensity: 1.1061 0.5698 0.0790 0.0066 0.0229 1.2596 5.8380 5.1617 4.6469 13.7366 2.0652 10.6952 2.3954 23.2074 2.2330 43.0102 123.4598 3.2462 6.0090 6.0863 6.4183 11.6762 7.4946 11.8827 10.6614 21.0562 1.8970 1.4359 11.5133 9.7410 0.5892 9.0976 19.8533 1.2855 7.6686 0.2427 22.4221 16.8060 5.8771 4.9227 2.6709 33.6110 8.7140 4.8919 58.5132 11.4241 26.9585 37.2354 2.6537 0.6260 54.3012 21.1077 32.6792 68.1080 25.4319 14.3087 13.6871 5.9064 60.3187 11.2700 4.5762 17.7037 33.2430 57.7587 29.7156 80.9111 63.3879 53.8243 60.7393 22.6289 5.1567 10.0590 14.6588 18.3087 3.4643 18.9217 127.1076 4.3763 677.6410 306.4859 16.1002 14.9015 36.3406 26.3962 34.3500 36.9666 7.3448 5.9358 16.3327 33.2391 16.7243 20.3865 0.3912 0.7090 1.9276 4.1438
temp: 298.150 k
press: 1.00000 atm
elementType: 8 8 8 7 7 7 7 6 6 6 6 6 6 6 6 6 6 6 1 1 1 1 1 1 1 1 1 1 1 1 1 1 1 1
symmnumber: 1
zpe: 709456.5 jmol-1
zpe.correction: 0.270218 hartree
zpe.thermalcorrener: 0.288639 hartree
zpe.thermalcorrenthalpy: 0.289583 hartree
zpe.thermalcorrgfe: 0.223649 hartree
zpe.sumelectzpe: -872.123299 hartree
zpe.sumelectthermal: -872.104878 hartree
zpe.sumelectthermalent: -872.103934 hartree
zpe.sumelectthermalfe: -872.169868 hartree
dipole: 3.3999 -2.7991 -1.1507
dipole: 4.5518
quadrupole: -105.6383 -111.1842 -106.7581
quadrupole: -4.8486 -3.2939 -1.0541
quadrupole: 2.2219 -3.3240 1.1021 -4.8486 -3.2939 -1.0541
hfenergy: -872.393517 hartree
pointgroup: C01 [X(C11H16N4O3)]
dipole: -1.2921299 1.1978664 -0.3201993 debye
polarizability: 204.2941876|-5.3001501|168.2430079|15.632942|7.3902549|99.0570472 unknown
InChI: InChI=1S/C11H16N4O3/c1-11(2,18)5-15-6-12-8-7(15)9(16)14(4)10(17)13(8)3/h6,18H,5H2,1-4H3
charge 0 multiplicity 1
34 atoms
O  -2.562705 -0.864572 1.411234
O  -0.197599 -2.218214 -0.902822
O  4.041685 -0.694165 0.486743
N  -1.114977 0.764701 -0.589656
N  2.346311 0.912981 0.261532
N  1.908662 -1.427065 -0.156479
N  0.400807 2.405747 -0.075193
C  -3.303369 -0.121488 0.370396
C  -2.394368 0.086849 -0.888321
C  0.114663 0.124149 -0.337473
C  1.013277 1.159119 -0.025697
C  -4.458796 -1.056385 -0.025412
C  -3.820964 1.212795 0.951766
C  -0.883927 2.122161 -0.417442
C  0.520749 -1.252563 -0.501173
C  2.839545 -0.413422 0.219299
C  3.258208 2.024009 0.597881
C  2.466348 -2.798041 -0.229668
H  -2.139772 -0.902022 -1.304677
H  -2.937536 0.679385 -1.646244
H  -5.122477 -1.217007 0.84059
H  -5.054118 -0.627803 -0.851587
H  -4.058809 -2.035846 -0.337584
H  -4.433057 1.766447 0.215361
H  -2.991432 1.868934 1.276117
H  -4.446588 1.005107 1.83651
H  -1.657486 2.871861 -0.562438
H  -1.788769 -0.322263 1.714837
H  4.248484 1.591007 0.799967
H  2.887661 2.561069 1.486782
H  3.316138 2.734321 -0.243753
H  1.642064 -3.473642 -0.499913
H  2.899063 -3.078428 0.74401
H  3.264383 -2.844316 -0.988895
