program: Gaussian 09
title: 000218656
version: EM64L-G09RevD.01
frameworkgroup: C1[X(C21H21ClN2O4)]
method: RPBEPBE
basis: SDD
operation: Freq
keyword: #p
keyword: freq=noraman
keyword: PBEPBE/SDD
title: #p freq=noraman PBEPBE/SDD
converged: YES YES NO NO
title: Mulliken charges:
elementType: Cl O O O O N N C C C C C C C C C C C C C C C C C C C C C H H H H H H H H H H H H H H H H H H H H H
charge: -0.037579 -0.320084 -0.284346 -0.244565 -0.211300 -0.067192 -0.427048 0.017688 0.363784 -0.376606 -0.372865 -0.695249 -0.691989 -0.247675 0.102759 0.004981 0.222644 0.292726 0.309790 -0.323055 -0.399060 -0.145065 -0.208488 -0.365909 -0.376417 -0.232430 -0.228642 -0.235378 0.227814 0.194130 0.273961 0.251490 0.234459 0.214079 0.220118 0.232088 0.230819 0.213306 0.222415 0.287871 0.330317 0.298865 0.249369 0.265558 0.254372 0.267350 0.233053 0.239681 0.235458
chargesum: 0.00000
title: Mulliken charges with hydrogens summed into heavy atoms:
elementType: Cl O O O O N N C C C C C C C C C C C C C C C C C C C C C
charge: -0.037579 -0.320084 -0.284346 -0.244565 -0.211300 -0.067192 -0.096732 0.245501 0.363784 0.091485 0.113084 -0.028964 -0.025450 0.040196 0.102759 0.004981 0.222644 0.292726 0.309790 -0.024189 -0.149691 -0.145065 0.057069 -0.111537 -0.109068 0.000623 0.011039 0.000080
polarizability: 3.59883015e+02 -8.73427512e+00 2.96419565e+02 8.73975308e-01 1.23536984e+01 1.69981030e+02
1716.lowfreq: -4.9798 -0.0020 -0.0014 -0.0008 3.5982 5.5007 13.9015 24.6600 32.5559
frequency: 13.5516 24.5128 32.5094 43.0955 52.2464 61.9510 68.6428 70.0970 78.3799 125.0638 140.9702 155.4768 171.3878 177.5130 190.6328 196.0455 218.9816 232.2777 262.2526 281.7703 302.9544 308.2290 316.2492 321.3284 331.7917 356.7538 366.5366 395.8825 399.9885 407.8207 410.1159 442.4749 453.8729 471.9587 492.5654 515.1492 523.8078 573.6753 601.6265 607.4761 615.1509 624.3395 636.8604 655.5318 666.4023 689.0984 704.0075 713.8233 727.3459 738.7491 769.7508 779.5368 791.3973 818.2693 830.8530 859.7074 862.7438 883.6239 889.1097 896.5010 906.1407 917.5397 932.3996 938.1360 941.1701 952.1872 969.6577 981.2940 987.3692 989.3523 990.1963 1004.5651 1026.7161 1031.9504 1078.5713 1085.2531 1087.8715 1104.1053 1104.9739 1124.0952 1140.8261 1167.3118 1172.9089 1175.3542 1189.5107 1192.7170 1215.1416 1233.2639 1239.5897 1239.8960 1260.7912 1265.3568 1275.8504 1290.0519 1297.9893 1317.7887 1337.3723 1341.2040 1356.4571 1361.5321 1376.7172 1380.7647 1386.1208 1389.2527 1433.8715 1437.3928 1449.9259 1451.2582 1462.6898 1467.2083 1467.7212 1471.1340 1475.5033 1481.0715 1537.8907 1572.6475 1586.7206 1599.5110 1608.8454 1645.1963 2949.3784 2962.9313 2994.6911 2999.1938 3002.1072 3034.2238 3095.3433 3101.7404 3103.9615 3108.4371 3110.4308 3130.1790 3131.7890 3138.9607 3139.4552 3149.6783 3158.7825 3170.9661 3171.7549 3177.1763 3497.6841
redmass: 4.6664 5.7335 4.7315 5.4231 4.2321 4.6018 6.6037 7.9233 4.6061 6.0400 4.2644 4.2739 1.0600 5.1480 4.7773 5.2723 1.3596 2.3810 6.3714 3.1227 5.6132 8.9476 3.1652 4.2817 4.6915 4.5145 5.7905 3.4811 2.6332 3.0434 5.4938 4.1826 4.8334 3.5371 3.9092 6.2322 4.0863 4.2348 2.6329 4.3926 6.4009 3.3016 5.0915 4.8242 6.1505 5.9337 1.8518 2.4398 5.4711 2.9121 4.0839 3.5251 3.3040 1.8346 3.2318 1.3571 2.7719 2.8268 5.3878 2.6593 1.7609 1.5116 3.4993 1.9478 2.1618 1.3715 6.0052 1.3095 1.6451 3.2550 4.4887 1.3288 2.1954 2.2049 3.1776 1.5973 2.2875 2.4544 3.1440 2.1981 1.9748 2.0345 1.3726 1.0742 1.1504 2.2569 2.2364 1.3293 1.2985 3.4537 1.6493 1.2567 2.0884 1.3209 3.3862 1.3709 1.2936 1.2618 1.4468 2.7195 1.2971 7.5076 6.5085 1.2280 2.2808 2.1994 1.0496 1.0505 1.0847 1.0668 2.6091 1.0520 1.0820 2.3616 8.8369 7.4502 6.5203 6.8173 6.1099 6.3001 1.0821 1.0706 1.0353 1.0366 1.0827 1.0596 1.1001 1.1003 1.0998 1.1004 1.1058 1.0852 1.0948 1.0880 1.0901 1.0924 1.0963 1.1002 1.0934 1.0961 1.0758
irintensity: 0.1089 0.0679 0.3541 1.2281 0.7323 0.5688 0.0143 1.7472 1.4065 1.6338 3.8040 4.7382 0.0354 3.6926 0.6877 1.3028 2.2790 1.4304 0.2266 5.1810 0.7616 3.1546 0.2719 2.7490 1.5761 3.3494 4.7368 5.3424 3.8424 1.1882 8.2716 1.5439 2.2927 19.2055 9.1703 2.4984 18.0377 31.9534 22.8307 0.4212 0.0750 19.6647 0.9638 10.0776 10.7349 12.9852 47.8645 57.9867 9.2488 18.1558 20.9190 5.0037 53.9601 45.0822 21.1041 7.2438 22.5161 7.0378 43.5853 1.0179 6.2272 0.7223 12.9322 4.0932 16.0245 1.6677 56.4030 0.8890 15.3606 105.5221 17.7995 1.9335 13.9241 73.3713 124.9167 9.3607 23.3340 90.9486 88.7938 12.0084 34.0373 3.8112 48.3108 6.8810 21.1873 28.4405 106.6052 10.3388 4.1948 46.6155 11.8654 15.1271 33.7195 10.6785 143.5298 8.3564 5.0468 3.3428 1.1629 18.5137 46.5053 2.6494 4.5580 25.5251 10.5110 12.9829 1.8200 2.4913 25.2316 0.2453 105.2370 17.4542 2.7291 2.5830 92.2018 31.3374 11.2197 1.3178 2.4238 486.3543 13.9506 41.1200 11.5241 22.2588 42.8085 23.8041 0.2163 21.9845 33.8440 43.5354 8.2898 0.9060 13.4112 2.9556 5.5076 15.7278 23.4003 15.5732 2.4495 2.1713 32.2359
temp: 298.150 k
press: 1.00000 atm
elementType: 17 8 8 8 8 7 7 6 6 6 6 6 6 6 6 6 6 6 6 6 6 6 6 6 6 6 6 6 1 1 1 1 1 1 1 1 1 1 1 1 1 1 1 1 1 1 1 1 1
symmnumber: 1
zpe: 996400.7 jmol-1
zpe.correction: 0.379509 hartree
zpe.thermalcorrener: 0.405049 hartree
zpe.thermalcorrenthalpy: 0.405993 hartree
zpe.thermalcorrgfe: 0.321892 hartree
zpe.sumelectzpe: -1681.241379 hartree
zpe.sumelectthermal: -1681.215840 hartree
zpe.sumelectthermalent: -1681.214896 hartree
zpe.sumelectthermalfe: -1681.298997 hartree
dipole: -4.8898 1.4470 -1.7207
dipole: 5.3819
quadrupole: -164.7469 -165.0895 -172.9324
quadrupole: 15.8500 9.3620 3.3164
quadrupole: 2.8427 2.5001 -5.3428 15.8500 9.3620 3.3164
hfenergy: -1681.6208884 hartree
pointgroup: C01 [X(C21H21Cl1N2O4)]
dipole: 2.0597683 -0.4481208 -0.1999507 debye
polarizability: 354.7611875|9.1053643|279.9725482|32.653264|-41.8536451|191.5498747 unknown
InChI: InChI=1S/C21H21ClN2O4/c1-21(2)27-12-15(28-21)11-26-20-19(25)23-17-9-8-14(22)10-16(17)18(24-20)13-6-4-3-5-7-13/h3-10,15,20,23H,11-12H2,1-2H3
charge 0 multiplicity 1
49 atoms
Cl 5.842458 0.658761 2.560698
O  -4.731213 0.491063 0.060869
O  -4.056117 -1.72216 -0.480599
O  -1.643047 2.362353 0.389036
O  -0.498855 2.903708 -2.216621
N  -0.125979 0.498095 0.159675
N  1.608402 2.335637 -1.431369
C  -3.238642 0.432391 0.060263
C  -5.250218 -0.888562 -0.160666
C  -2.975039 -0.784063 -0.845147
C  -2.739447 1.802986 -0.437096
C  -5.863691 -1.445943 1.125982
C  -6.214419 -0.837807 -1.350747
C  -0.2969 1.957363 0.097408
C  0.213742 2.441146 -1.291116
C  1.074312 -0.018845 0.342208
C  2.332063 0.791521 0.400932
C  2.559701 1.910563 -0.465238
C  1.159883 -1.504184 0.506371
C  3.354433 0.428778 1.323095
C  3.806443 2.592976 -0.421897
C  4.562126 1.137381 1.359739
C  4.813402 2.213319 0.481375
C  2.289168 -2.241681 0.056563
C  0.065987 -2.205672 1.083399
C  2.320727 -3.647517 0.180622
C  0.102312 -3.608294 1.212641
C  1.22992 -4.335192 0.760787
H  -2.870636 0.255895 1.089623
H  -3.044753 -0.496417 -1.915285
H  -2.01819 -1.28462 -0.650109
H  -3.555478 2.530135 -0.303103
H  -2.448438 1.784448 -1.501252
H  -6.774456 -0.882034 1.391344
H  -6.127716 -2.509286 0.989534
H  -5.139519 -1.364526 1.953414
H  -5.678634 -0.515514 -2.259432
H  -6.654005 -1.834334 -1.529524
H  -7.027421 -0.118122 -1.150764
H  0.304497 2.481194 0.872283
H  1.969329 2.773597 -2.285847
H  3.188707 -0.413014 2.000669
H  3.977113 3.442428 -1.092759
H  5.765939 2.749336 0.51412
H  3.132012 -1.720966 -0.410404
H  -0.799128 -1.633573 1.433894
H  3.191949 -4.20535 -0.179539
H  -0.746196 -4.134249 1.6629
H  1.257109 -5.42595 0.859467
