program: Gaussian 09
title: 000218655
version: EM64L-G09RevD.01
frameworkgroup: C1[X(C14H10ClNO2)]
method: RPBEPBE
basis: SDD
operation: Freq
keyword: #p
keyword: freq=noraman
keyword: PBEPBE/SDD
title: #p freq=noraman PBEPBE/SDD
converged: YES YES NO NO
title: Mulliken charges:
elementType: Cl O O N C C C C C C C C C C C C C C H H H H H H H H H H
charge: -0.052791 -0.442598 -0.254429 -0.077746 0.261085 0.508127 0.253531 -0.335030 -0.362502 -0.348426 -0.306912 -0.354246 -0.282596 -0.357788 -0.228805 -0.227950 -0.213726 0.109704 0.250584 0.256108 0.271755 0.276227 0.251134 0.285014 0.260217 0.238321 0.239984 0.383754
chargesum: 0.00000
title: Mulliken charges with hydrogens summed into heavy atoms:
elementType: Cl O O N C C C C C C C C C C C C C C
charge: -0.052791 -0.058844 -0.254429 -0.077746 0.261085 0.508127 0.253531 -0.084446 -0.106394 -0.076671 -0.030685 -0.103112 -0.282596 -0.072774 0.031412 0.010371 0.026258 0.109704
polarizability: 3.80785034e+02 1.50632511e+01 1.70623133e+02 -6.25327979e+00 9.12007265e+00 8.15688809e+01
1716.lowfreq: -8.9316 -0.0018 -0.0017 -0.0015 1.6754 3.8219 26.0745 34.4311 46.2893
frequency: 25.7863 34.4269 46.2853 77.2447 97.6911 127.9263 161.7619 171.0507 183.6158 218.9699 266.5477 316.7559 342.4475 383.0778 406.5627 412.3662 449.2467 468.8339 492.5052 522.1997 537.0004 561.0530 591.3044 616.1242 630.2285 671.3827 687.2723 724.1963 729.2586 761.9320 770.3056 825.1345 838.4568 850.6115 874.0091 881.2999 965.7288 984.2588 986.3339 992.3357 997.3425 1005.0958 1014.6945 1019.9315 1036.0681 1114.5202 1115.4608 1147.5144 1170.4523 1175.8164 1196.2555 1235.8895 1278.3900 1299.5078 1321.4591 1346.8822 1368.0757 1394.1599 1422.9391 1426.5820 1458.2311 1492.7992 1557.3360 1563.4628 1585.1207 1605.7505 1622.9109 1639.1223 3009.6231 3138.5577 3140.5600 3153.6785 3158.3606 3162.3818 3166.9603 3178.6203 3182.2753 3533.6151
redmass: 6.2309 7.2319 6.9648 6.1402 5.9091 6.3101 4.7784 7.1093 6.3188 7.0537 3.2356 6.2127 6.7786 8.8871 7.3135 2.9648 3.3447 5.6477 4.3498 3.6683 3.4518 5.8960 1.2579 5.4396 7.0999 6.3431 3.5369 3.9754 5.4933 2.9488 1.4573 5.7776 2.0010 1.5869 2.1185 1.3982 1.3666 1.3541 1.6321 1.3894 3.4029 1.4064 6.4637 2.8939 2.0231 1.3480 1.7515 1.6618 1.1213 1.6290 1.5941 1.7919 1.7783 1.3157 2.7763 2.3117 5.1495 2.8631 4.2556 2.3265 2.5654 2.7732 7.4887 6.4394 6.2836 7.2723 6.5481 8.5792 1.0878 1.0882 1.0861 1.0905 1.0892 1.0962 1.0959 1.0995 1.0968 1.0642
irintensity: 0.3741 0.3467 0.1849 1.0779 0.1353 2.8385 4.3888 1.8369 2.8848 0.4622 21.6824 2.1343 3.9308 7.8776 18.3436 5.5000 14.7541 8.0818 11.4261 15.8039 18.2395 11.9849 74.3553 48.5233 0.1557 34.2616 74.1596 19.1234 2.5184 7.5850 77.5932 1.1115 34.4032 12.0963 44.1256 5.7042 0.8466 1.2089 24.7901 5.5258 183.7550 14.8073 74.5459 201.4063 3.5613 8.0607 22.6466 206.5822 5.0485 7.1619 18.4296 7.7346 52.8745 1.9519 164.6924 17.6922 6.5726 8.4191 21.3891 46.2831 9.3647 22.8490 39.8024 34.2123 307.9487 15.1118 13.9291 368.6986 21.3453 3.8618 1.5709 4.1977 2.9333 3.1635 9.9772 18.7473 2.3531 60.5648
temp: 298.150 k
press: 1.00000 atm
elementType: 17 8 8 7 6 6 6 6 6 6 6 6 6 6 6 6 6 6 1 1 1 1 1 1 1 1 1 1
symmnumber: 1
zpe: 533055.6 jmol-1
zpe.correction: 0.203030 hartree
zpe.thermalcorrener: 0.218480 hartree
zpe.thermalcorrenthalpy: 0.219424 hartree
zpe.thermalcorrgfe: 0.157978 hartree
zpe.sumelectzpe: -1203.506555 hartree
zpe.sumelectthermal: -1203.491105 hartree
zpe.sumelectthermalent: -1203.490161 hartree
zpe.sumelectthermalfe: -1203.551607 hartree
dipole: -3.2755 -2.0271 -0.4333
dipole: 3.8764
quadrupole: -93.6293 -108.9579 -113.9547
quadrupole: -2.4422 -7.7085 0.5719
quadrupole: 11.8847 -3.4439 -8.4408 -2.4422 -7.7085 0.5719
hfenergy: -1203.7095851 hartree
pointgroup: C01 [X(C14H10Cl1N1O2)]
dipole: 1.3419423 0.5021922 -0.5223533 debye
polarizability: 381.6684803|5.8964119|133.4514824|7.3503196|-44.2342084|117.8570855 unknown
InChI: InChI=1S/C14H10ClNO2/c15-13-4-2-1-3-11(13)9-16-12-7-5-10(6-8-12)14(17)18/h1-9,17H
charge 0 multiplicity 1
28 atoms
Cl 3.303018 -2.608833 1.197745
O  -5.859227 0.29518 -1.051934
O  -5.757799 -0.667551 1.059681
N  0.520422 0.541222 -0.32377
C  -0.872389 0.326754 -0.202742
C  2.838826 -0.050174 0.076507
C  -3.691086 0.018978 -0.047947
C  -1.472303 -0.251806 0.95698
C  -1.706636 0.775349 -1.266214
C  -2.866631 -0.400822 1.029694
C  -3.099298 0.610108 -1.197165
C  1.393207 -0.33031 0.120897
C  3.812321 -0.980678 0.528442
C  3.314334 1.195286 -0.431478
C  5.192162 -0.707892 0.487697
C  4.687994 1.487814 -0.4815
C  5.630836 0.535144 -0.020932
C  -5.157035 -0.16352 0.077988
H  -0.842775 -0.548605 1.80332
H  -1.23389 1.242019 -2.135612
H  -3.34308 -0.836927 1.913932
H  -3.74235 0.940412 -2.01724
H  1.092988 -1.316653 0.522212
H  2.559126 1.907315 -0.779651
H  5.908526 -1.452174 0.846425
H  5.02948 2.450279 -0.875884
H  6.703367 0.753523 -0.055314
H  -6.830409 0.142364 -0.902239
