program: Gaussian 09
title: 000218652
version: EM64L-G09RevD.01
frameworkgroup: C1[X(C22H26FN3O4)]
method: RPBEPBE
basis: SDD
operation: Freq
keyword: #p
keyword: freq=noraman
keyword: PBEPBE/SDD
title: #p freq=noraman PBEPBE/SDD
converged: YES YES NO NO
title: Mulliken charges:
elementType: F O O O O N N N C C C C C C C C C C C C C C C C C C C C C C H H H H H H H H H H H H H H H H H H H H H H H H H H
charge: -0.195058 -0.267041 -0.220867 -0.206483 -0.211019 -0.083246 -0.088655 0.021693 -0.368269 -0.362137 -0.379060 -0.379094 -0.348597 -0.369053 -0.415537 -0.308285 -0.530580 0.123285 0.299310 0.398175 -0.308780 -0.321796 -0.473153 -0.377189 0.381802 -0.385287 -0.368902 -0.159460 0.334259 -0.383691 0.184425 0.203896 0.209301 0.194226 0.205764 0.187392 0.195403 0.199028 0.193606 0.217891 0.222449 0.205927 0.218923 0.229338 0.222017 0.230936 0.247658 0.225280 0.253160 0.284922 0.308663 0.261147 0.260440 0.263535 0.240372 0.287015
chargesum: 0.00000
title: Mulliken charges with hydrogens summed into heavy atoms:
elementType: F O O O O N N N C C C C C C C C C C C C C C C C C C C C C C
charge: -0.195058 -0.267041 -0.220867 -0.206483 -0.211019 -0.083246 -0.088655 0.021693 0.020051 0.041390 0.014097 0.015337 0.062900 0.059323 0.032724 0.144668 -0.057642 0.123285 0.299310 0.398175 -0.055620 -0.036873 -0.164489 -0.116042 0.381802 -0.124846 -0.105367 0.080911 0.334259 -0.096676
polarizability: 3.89986891e+02 -5.23810765e+00 2.96056156e+02 -2.91267462e+01 7.52631735e+00 1.61448451e+02
1716.lowfreq: -9.7016 -2.1168 -0.0008 0.0008 0.0011 2.3013 4.9200 10.9374 12.6898
frequency: 4.8800 8.7805 11.8901 20.3548 22.8300 31.8912 46.5416 53.9187 71.5373 81.3658 98.5307 103.9198 114.8228 138.9591 143.0190 170.4393 178.9007 193.0588 230.9436 236.2588 241.3227 248.4137 273.0538 283.1385 293.2458 326.7883 341.9105 349.4372 371.0588 379.4669 389.1597 408.7444 410.6297 431.9018 448.4299 476.4304 477.5680 491.4308 493.9548 529.3681 531.1359 563.3567 573.3320 586.1297 623.9501 624.9241 655.0135 672.1128 690.4297 705.5179 723.3399 745.2722 763.7560 785.6938 788.2179 806.7987 810.9962 817.2484 819.9613 842.3612 844.1118 882.8029 890.2870 895.2871 925.0118 932.1780 955.2048 963.1492 969.5775 985.4643 988.1277 989.4219 1004.1991 1005.4264 1021.5220 1023.0756 1049.2564 1050.2588 1072.5166 1079.4941 1082.7287 1087.1586 1096.7261 1104.1789 1106.3375 1134.2538 1143.1058 1144.2352 1152.6770 1156.9732 1165.5307 1191.1459 1196.5799 1201.2331 1206.5342 1214.0058 1226.1323 1227.6913 1249.5399 1267.7450 1278.4241 1285.9664 1292.5478 1294.2619 1306.7775 1307.1867 1318.6969 1323.7690 1336.5784 1339.8417 1354.6222 1370.5403 1371.8723 1372.5696 1380.2455 1391.9287 1396.3094 1402.3587 1410.4382 1433.3639 1443.3722 1448.2548 1450.9432 1454.9938 1459.3592 1464.3016 1467.2886 1476.8493 1480.7178 1484.3534 1491.3281 1572.7430 1581.6077 1600.9125 1613.2424 1617.4372 2856.3732 2865.4258 2872.6548 2878.4313 2886.6838 2905.8646 2964.9584 2976.8509 2999.8557 3006.6131 3019.8874 3027.6620 3030.8925 3033.6394 3036.6964 3058.1824 3059.2866 3074.4140 3151.5657 3155.4022 3158.3462 3174.0029 3178.3507 3181.3490 3188.6877 3194.4346
redmass: 7.0733 3.9042 6.3778 4.8848 6.5650 4.2009 6.2271 7.3713 5.4582 5.8815 5.2263 9.8127 4.1058 2.6545 2.9388 4.3073 3.7009 4.2576 2.8402 3.6814 2.3394 3.2332 2.8765 5.8071 4.4086 2.9214 2.4594 4.5866 5.0658 5.6667 4.7216 2.1925 2.9260 3.3313 5.2040 3.3321 4.0331 3.2227 5.2903 4.7749 5.0991 2.5525 4.8225 5.7723 2.8627 4.1938 7.2564 2.4369 2.4024 5.0935 3.6270 7.2954 4.4930 2.5779 2.4019 1.4070 2.8134 1.3052 1.3390 1.4720 1.5298 2.3059 5.2546 1.6040 1.3982 2.0195 1.6568 3.0163 5.7023 6.6308 1.3355 1.3573 2.6200 2.4320 2.1595 2.1816 1.7281 2.2664 1.8415 1.8436 1.7366 1.9282 2.7534 2.3427 1.3283 2.5526 2.6134 2.5270 1.7350 1.4182 1.1217 1.2511 1.0959 1.7915 1.8089 8.0255 4.0403 2.2779 1.8166 1.3285 1.3178 1.3565 1.2771 1.2816 1.2694 1.2458 1.3186 1.3745 1.6999 1.2707 1.3895 2.1398 2.1602 1.7800 5.9005 1.4904 2.8747 1.8601 4.1337 1.1066 3.5948 1.0822 1.0807 1.0818 1.0971 1.1517 1.4251 1.4103 1.1052 1.2017 2.5757 7.8621 6.8228 7.1837 7.2055 7.2320 1.0704 1.0703 1.0695 1.0695 1.0675 1.0693 1.0604 1.0563 1.0905 1.0769 1.0805 1.0912 1.0880 1.0931 1.0931 1.0888 1.1021 1.1025 1.0880 1.0885 1.0891 1.0950 1.0964 1.0974 1.0913 1.0962
irintensity: 0.0262 0.4709 0.2114 0.5719 0.1753 0.6132 0.2942 0.1929 0.5878 1.8426 1.7558 3.4663 0.5768 2.4101 4.4385 0.2481 0.6941 7.4407 1.0833 1.4832 0.2810 0.5440 0.2532 1.0667 7.4488 0.4321 18.5220 1.4956 1.1114 2.5139 3.5428 0.5515 0.0348 0.2928 2.8515 7.5392 4.6414 6.2005 8.3897 4.3928 3.6196 10.5724 22.4626 7.0835 0.3196 2.1051 3.9293 13.2474 7.6637 29.6160 0.0873 35.3801 13.4210 13.0630 10.1041 40.3199 20.6496 2.4495 18.8991 56.4121 4.4173 2.1958 0.3497 28.3206 3.2052 4.0153 11.6674 42.7082 105.7360 38.5104 1.6941 0.8349 34.9426 49.4121 4.1908 16.8660 3.3335 4.1792 3.0141 9.5195 11.2028 22.8360 4.0009 0.7194 12.6342 53.2036 62.3952 57.9364 22.4352 76.2012 5.6743 2.6483 3.4660 2.2249 74.4259 202.0341 306.4368 152.5443 46.5886 14.0353 5.2187 28.9794 2.4872 12.8852 14.4050 6.6052 8.8235 15.4432 63.6932 8.8353 4.2979 65.2060 49.5101 3.6026 16.4766 5.0084 29.5427 40.5582 15.7758 29.5068 4.3302 7.8653 0.9128 14.8354 15.7265 27.6542 127.3300 53.7405 9.6314 8.4091 26.2964 129.7845 14.4932 92.8604 43.8238 99.2607 77.4365 13.5845 24.2504 70.0306 182.5675 109.6503 44.4751 26.6220 18.6108 10.2946 33.1732 28.6530 75.1183 24.4672 12.4325 16.3050 71.5529 29.5096 9.7037 6.5836 0.1075 5.4052 3.3121 4.5850 3.9923 4.9347
temp: 298.150 k
press: 1.00000 atm
elementType: 9 8 8 8 8 7 7 7 6 6 6 6 6 6 6 6 6 6 6 6 6 6 6 6 6 6 6 6 6 6 1 1 1 1 1 1 1 1 1 1 1 1 1 1 1 1 1 1 1 1 1 1 1 1 1 1
symmnumber: 1
zpe: 1176235.6 jmol-1
zpe.correction: 0.448005 hartree
zpe.thermalcorrener: 0.476313 hartree
zpe.thermalcorrenthalpy: 0.477257 hartree
zpe.thermalcorrgfe: 0.381239 hartree
zpe.sumelectzpe: -1416.584139 hartree
zpe.sumelectthermal: -1416.555831 hartree
zpe.sumelectthermalent: -1416.554887 hartree
zpe.sumelectthermalfe: -1416.650905 hartree
dipole: -2.7600 -6.7069 -0.2311
dipole: 7.2563
quadrupole: -168.6642 -191.7337 -177.1320
quadrupole: -15.9698 -7.0650 -5.4033
quadrupole: 10.5124 -12.5571 2.0447 -15.9698 -7.0650 -5.4033
hfenergy: -1417.032144 hartree
pointgroup: C01 [X(C22H26F1N3O4)]
dipole: 1.1037627 2.6320513 0.0642375 debye
polarizability: 390.8814835|-7.7237863|296.5532206|24.4517356|1.4341193|160.0567939 unknown
InChI: InChI=1S/C22H26FN3O4/c23-19-8-6-18(7-9-19)22(27)5-2-10-24-11-13-25(14-12-24)15-16-30-21-4-1-3-20(17-21)26(28)29/h1,3-4,6-9,17H,2,5,10-16H2
charge 0 multiplicity 1
56 atoms
F  10.172133 -2.627136 0.217919
O  -5.222239 1.551822 0.056707
O  4.164055 -0.75996 -1.017241
O  -7.889351 -3.921234 0.13054
O  -5.673317 -3.522414 0.486007
N  1.336403 2.177645 0.320034
N  -1.553088 2.007867 0.559313
N  -6.876907 -3.12642 0.231824
C  0.64704 2.469962 1.601729
C  0.557097 1.176037 -0.452669
C  -0.77208 3.000773 1.338291
C  -0.863764 1.696114 -0.719539
C  2.753134 1.778193 0.510858
C  -2.975267 2.37481 0.381545
C  3.601021 1.997244 -0.761583
C  -3.839253 1.107104 0.340134
C  5.044203 1.480044 -0.601074
C  5.163048 -0.047135 -0.702975
C  6.499336 -0.688551 -0.448628
C  -6.21951 0.581861 -0.021764
C  7.663236 0.06342 -0.129484
C  6.595407 -2.105303 -0.539998
C  -5.998871 -0.80373 0.156256
C  -7.52629 1.066636 -0.301393
C  -7.108833 -1.669866 0.045119
C  8.89854 -0.5782 0.094333
C  7.818032 -2.764797 -0.318219
C  -8.606867 0.170338 -0.404112
C  8.94433 -1.980191 -0.005203
C  -8.414968 -1.219415 -0.231953
H  0.571261 1.559662 2.249447
H  1.22609 3.236416 2.150337
H  1.061513 0.983896 -1.415406
H  0.493099 0.20343 0.096832
H  -1.282409 3.176271 2.303598
H  -0.693114 3.978885 0.800734
H  -0.800028 2.60288 -1.371998
H  -1.435794 0.923015 -1.264866
H  3.170601 2.401643 1.326689
H  2.837026 0.711814 0.834927
H  -3.30128 2.993237 1.237266
H  -3.157308 2.973641 -0.542156
H  3.608793 3.07735 -0.996562
H  3.134956 1.475126 -1.616007
H  -3.504057 0.414484 -0.457375
H  -3.798535 0.582494 1.313703
H  5.696127 1.917209 -1.386023
H  5.47346 1.815653 0.365427
H  7.616771 1.154068 -0.056337
H  5.689488 -2.667056 -0.788881
H  -5.017831 -1.230581 0.375035
H  -7.664243 2.144003 -0.433189
H  9.805257 -0.018067 0.339225
H  7.909601 -3.852615 -0.383194
H  -9.608012 0.556368 -0.620356
H  -9.234439 -1.937449 -0.306442
