program: Gaussian 09
title: 000218646
version: EM64L-G09RevD.01
frameworkgroup: C1[X(C23H29FN2O3)]
method: RPBEPBE
basis: SDD
operation: Freq
keyword: #p
keyword: freq=noraman
keyword: PBEPBE/SDD
title: #p freq=noraman PBEPBE/SDD
converged: YES YES NO NO
title: Mulliken charges:
elementType: F O O O N N C C C C C C C C C C C C C C C C C C C C C C C H H H H H H H H H H H H H H H H H H H H H H H H H H H H H
charge: -0.197137 -0.273443 -0.229693 -0.269976 -0.098800 -0.086070 -0.359856 -0.365782 -0.372874 -0.376926 -0.361700 -0.368714 -0.443820 -0.303604 -0.515779 0.125096 0.301053 0.346214 -0.308328 -0.324035 -0.345492 -0.354350 -0.385604 -0.369944 -0.353169 -0.326773 0.332683 0.313603 -0.537025 0.201024 0.189712 0.187452 0.211388 0.186719 0.199102 0.209149 0.184244 0.244417 0.189849 0.201492 0.222034 0.201580 0.232150 0.220009 0.206684 0.235208 0.264054 0.256108 0.283627 0.246514 0.250340 0.259234 0.261461 0.236932 0.250714 0.217608 0.217991 0.243450
chargesum: 0.00000
title: Mulliken charges with hydrogens summed into heavy atoms:
elementType: F O O O N N C C C C C C C C C C C C C C C C C C C C C C C
charge: -0.197137 -0.273443 -0.229693 -0.269976 -0.098800 -0.086070 0.030881 0.033058 0.012947 0.016467 0.072566 0.054813 -0.010090 0.123089 -0.016517 0.125096 0.301053 0.346214 -0.052221 -0.040409 -0.098978 -0.104009 -0.126370 -0.108484 -0.116237 -0.076059 0.332683 0.313603 0.142024
polarizability: 3.69023791e+02 2.01141897e+01 2.74682059e+02 3.48156554e+01 -1.10277125e-01 1.89077056e+02
1716.lowfreq: -13.7555 -3.3745 -0.0010 0.0007 0.0009 3.1377 5.6489 7.9546 16.8550
frequency: 1.6931 7.6470 15.8294 22.5434 26.5867 37.8809 46.4817 60.3645 75.9617 91.8753 102.4778 107.9773 116.5471 137.7634 163.0369 168.6033 176.9343 192.9706 222.1115 239.5431 253.7656 271.6528 280.4713 285.5937 296.5142 337.1321 345.7186 355.9528 363.0579 370.5333 382.1124 410.7592 412.8215 418.6344 441.1873 464.2115 473.4391 481.3869 499.8828 509.6446 516.2541 526.3829 563.1611 586.7596 605.8343 624.6047 630.1964 697.3121 710.9440 714.2116 725.8561 748.9352 774.9579 789.5880 800.3412 814.2401 817.7149 825.3980 829.6053 837.5111 846.2470 854.1139 882.5139 905.0834 930.1301 950.7204 954.0985 967.3643 981.4141 984.9877 989.9347 990.3230 999.0538 1005.8944 1008.4266 1027.4095 1043.8092 1052.8429 1075.7944 1085.4483 1099.4090 1105.2996 1108.4227 1109.7952 1112.1351 1133.1697 1138.5925 1142.5544 1153.9675 1154.3287 1156.5317 1174.9088 1183.5837 1194.2864 1197.4661 1200.5299 1202.1834 1226.8024 1236.5925 1248.9376 1269.1897 1274.7212 1286.1705 1291.9261 1292.3078 1296.9093 1305.9160 1322.6042 1329.9093 1339.6542 1348.7395 1352.8817 1364.5332 1370.7488 1380.0029 1380.4432 1387.7952 1402.8881 1409.4137 1421.2740 1425.7189 1435.2476 1454.0301 1454.5746 1458.7809 1463.1581 1464.6737 1466.4356 1471.8825 1474.9654 1482.6928 1484.4154 1490.5716 1497.9283 1572.2851 1588.7631 1600.9361 1612.7764 1626.1859 2850.7953 2860.3522 2865.4999 2868.5688 2880.3532 2899.6688 2952.0149 2957.3419 2957.7518 2996.1661 3015.7679 3020.0205 3032.2299 3034.9680 3036.3700 3036.4236 3041.5305 3044.2242 3052.5628 3062.1958 3120.7827 3146.9889 3153.3284 3156.9812 3157.5183 3167.6313 3175.2623 3177.4275 3180.8599
redmass: 4.7722 6.7787 4.6716 4.4149 4.7737 3.7299 4.4425 4.4784 4.4540 4.0421 7.7376 5.2112 3.3903 2.1788 4.2857 4.4544 3.4453 3.7054 3.0947 1.1869 1.9416 2.8959 4.2455 3.6679 3.9067 2.9823 2.3890 4.0758 5.9499 4.2428 3.3245 2.9402 2.1655 3.0486 3.6201 4.6698 3.1623 2.8319 3.1850 3.8194 2.3412 4.5121 2.9583 4.5085 2.3266 7.1699 6.4435 2.8629 5.2515 3.5593 3.7049 3.6476 3.2779 1.3365 5.4742 2.3351 1.3739 1.6659 1.5905 1.5521 1.5260 1.8194 2.9075 1.3812 2.0917 1.5903 1.3359 1.8834 7.5898 3.3264 1.8618 3.0395 2.9771 2.4811 2.4055 2.0049 2.0877 1.7139 1.7926 2.7090 2.1651 1.3488 2.0017 1.4022 1.2611 2.2347 2.8359 2.4757 1.5260 1.4265 1.4365 1.2261 1.2149 1.1339 1.3141 2.7937 2.1189 2.6405 5.3289 1.7814 1.3240 1.2844 1.3549 1.2737 1.2426 1.2922 1.2923 1.3219 1.4176 1.5298 1.3964 1.4769 1.4261 1.7208 3.1645 5.3873 1.4566 1.5310 3.9384 1.1168 3.8672 1.1692 1.0824 1.0806 1.0899 1.0899 1.0505 1.0908 1.1228 1.0839 1.0963 1.1583 2.5955 1.9594 7.6625 7.7189 7.1399 7.2137 6.3934 1.0712 1.0705 1.0708 1.0702 1.0686 1.0694 1.0335 1.0605 1.0566 1.0672 1.0925 1.1011 1.0899 1.0908 1.1019 1.0899 1.0881 1.0889 1.0953 1.0984 1.0987 1.0869 1.0878 1.0884 1.0889 1.0953 1.0975 1.0965 1.0974
irintensity: 0.3886 0.1874 0.7019 1.1199 0.2674 0.2283 0.7347 0.5009 0.0379 2.0074 5.5824 0.6051 2.3726 2.3072 7.1517 0.7845 10.1425 1.3097 5.1182 0.6913 2.6117 1.5097 1.0864 1.6345 9.2906 11.9876 13.9159 0.5989 0.0864 4.9516 11.8810 0.0271 0.4016 0.0047 0.2119 4.4192 5.1891 1.4782 4.5451 7.9596 19.6513 0.2400 7.5655 21.3686 6.4898 0.5273 0.6881 15.7574 52.6465 0.0046 0.4985 8.1889 12.9117 21.0230 13.2230 1.4797 34.2400 8.8864 73.1538 48.7672 0.0752 31.0137 5.6920 0.0337 1.7163 7.8267 0.0026 17.8384 66.4154 64.3264 32.0080 7.9747 75.7430 1.7890 60.6496 5.2697 2.4136 4.4757 8.0239 0.8225 4.5473 8.2500 12.8763 10.4571 0.1804 28.2951 30.9394 94.9333 27.1469 9.6031 66.0132 7.1814 13.3312 19.3121 7.5187 474.5798 33.8209 131.1182 15.7261 23.0943 13.7803 4.1820 11.4780 8.4807 13.2498 6.1190 5.0197 22.9953 27.9404 52.7103 11.5622 42.4977 3.2163 6.4184 4.9585 20.2629 1.8162 3.4248 17.8310 22.5275 3.7821 24.1472 1.2399 1.3682 6.5047 27.6146 13.1631 7.6817 139.5949 8.8455 18.5616 66.5847 26.7458 208.8002 104.4098 10.0183 78.8148 51.4773 3.9429 64.8765 27.8617 32.7940 22.9298 288.8858 111.2657 67.3783 72.0186 49.1218 22.8384 14.3552 21.3157 2.9363 80.2879 20.0295 94.3537 13.2362 17.5362 60.2565 32.9725 30.1329 19.8923 4.6670 5.9541 0.0086 14.2284 3.1418 4.6437 3.8119
temp: 298.150 k
press: 1.00000 atm
elementType: 9 8 8 8 7 7 6 6 6 6 6 6 6 6 6 6 6 6 6 6 6 6 6 6 6 6 6 6 6 1 1 1 1 1 1 1 1 1 1 1 1 1 1 1 1 1 1 1 1 1 1 1 1 1 1 1 1 1
symmnumber: 1
zpe: 1255360.3 jmol-1
zpe.correction: 0.478141 hartree
zpe.thermalcorrener: 0.506372 hartree
zpe.thermalcorrenthalpy: 0.507316 hartree
zpe.thermalcorrgfe: 0.411550 hartree
zpe.sumelectzpe: -1326.631724 hartree
zpe.sumelectthermal: -1326.603493 hartree
zpe.sumelectthermalent: -1326.602549 hartree
zpe.sumelectthermalfe: -1326.698315 hartree
dipole: -1.1152 -1.9547 -1.9035
dipole: 2.9475
quadrupole: -184.6502 -177.5577 -167.8566
quadrupole: 20.6910 2.9250 3.5165
quadrupole: -7.9620 -0.8695 8.8316 20.6910 2.9250 3.5165
hfenergy: -1327.1098653 hartree
pointgroup: C01 [X(C23H29F1N2O3)]
dipole: -0.4172503 -0.9164024 -0.5752328 debye
polarizability: 367.7750639|29.1979222|272.5118386|29.8927712|-16.4964553|192.4960029 unknown
InChI: InChI=1S/C23H29FN2O3/c1-28-21-8-10-22(11-9-21)29-18-17-26-15-13-25(14-16-26)12-2-3-23(27)19-4-6-20(24)7-5-19/h4-11H,2-3,12-18H2,1H3
charge 0 multiplicity 1
58 atoms
F  8.305136 3.709869 -0.969858
O  -4.298257 1.079896 0.290806
O  5.868014 -1.943208 0.830442
O  -9.788182 0.297569 -0.721349
N  1.679754 -1.678913 0.564371
N  -0.941401 -0.451459 0.845062
C  0.537252 -2.096935 -0.285286
C  1.18446 -1.202857 1.880715
C  -0.450311 -0.933485 -0.470476
C  0.202967 -0.034634 1.694917
C  2.73002 -2.722504 0.689606
C  -1.986484 0.592089 0.726576
C  3.594853 -2.858606 -0.585308
C  -3.363929 -0.039245 0.480556
C  4.272223 -1.530875 -0.973273
C  5.473547 -1.173233 -0.096527
C  6.193838 0.122982 -0.356287
C  -5.648902 0.767145 0.046642
C  5.771949 1.045473 -1.352354
C  7.339198 0.430458 0.429559
C  -6.174279 -0.542771 -0.022499
C  -6.507837 1.882048 -0.138511
C  6.473313 2.250123 -1.564663
C  8.053746 1.626516 0.232743
C  -7.554649 -0.740561 -0.278371
C  -7.873507 1.687008 -0.39113
C  7.59992 2.510489 -0.764537
C  -8.405522 0.372515 -0.463093
C  -10.37984 -1.036974 -0.80276
H  0.914852 -2.410599 -1.275376
H  -0.00583 -2.964933 0.167714
H  0.666757 -2.01899 2.445084
H  2.048433 -0.864592 2.482172
H  0.061005 -0.111832 -1.034727
H  -1.307027 -1.278286 -1.077892
H  -0.184273 0.279858 2.681565
H  0.756263 0.828203 1.245295
H  3.391439 -2.44139 1.528498
H  2.288747 -3.719466 0.941346
H  -1.772524 1.325879 -0.087319
H  -2.031587 1.162779 1.671637
H  2.975663 -3.211702 -1.432121
H  4.361933 -3.632001 -0.39552
H  -3.663214 -0.654216 1.352216
H  -3.35936 -0.682039 -0.423957
H  4.609092 -1.548519 -2.029866
H  3.514194 -0.723228 -0.892996
H  4.891622 0.832896 -1.966012
H  7.647692 -0.291839 1.192052
H  -5.532551 -1.417133 0.121426
H  -6.082571 2.888587 -0.08036
H  6.163525 2.973672 -2.323913
H  8.936492 1.87873 0.827134
H  -7.94144 -1.762965 -0.327437
H  -8.548971 2.535405 -0.536255
H  -9.934462 -1.627738 -1.627958
H  -10.263678 -1.590203 0.150486
H  -11.44811 -0.868257 -1.004128
