program: Gaussian 09
title: 000218638
version: EM64L-G09RevD.01
frameworkgroup: C1[X(C21H17ClN3O)]
method: RPBEPBE
basis: SDD
operation: Freq
keyword: #p
keyword: freq=noraman
keyword: PBEPBE/SDD
title: #p freq=noraman PBEPBE/SDD
converged: YES YES NO NO
title: Mulliken charges:
elementType: Cl O N N N C C C C C C C C C C C C C C C C C C C C C H H H H H H H H H H H H H H H H H
charge: 0.014214 -0.207822 -0.208039 -0.070821 -0.087386 -0.295352 0.249225 0.215722 0.020541 0.178623 0.304876 -0.314822 -0.313291 -0.625161 -0.114043 -0.057523 -0.216826 -0.165460 -0.351664 -0.374528 -0.194129 -0.213943 -0.137236 -0.225961 -0.220470 -0.221015 0.277063 0.265545 0.308439 0.254308 0.286617 0.249742 0.280398 0.328603 0.280380 0.259285 0.256407 0.275686 0.277187 0.285189 0.249072 0.245876 0.252494
chargesum: 1.00000
title: Mulliken charges with hydrogens summed into heavy atoms:
elementType: Cl O N N N C C C C C C C C C C C C C C C C C C C C C
charge: 0.014214 -0.207822 -0.208039 -0.070821 -0.087386 -0.018290 0.249225 0.215722 0.020541 0.178623 0.304876 -0.049277 -0.004852 0.165506 0.166355 0.271080 0.063554 -0.165460 -0.092379 -0.118121 0.081557 0.063243 0.147954 0.023111 0.025405 0.031479
polarizability: 3.57370197e+02 -1.68437168e-01 2.88120251e+02 -1.28772196e+00 7.91027593e-01 1.71327545e+02
1716.lowfreq: -0.0010 0.0016 0.0017 0.6836 4.8624 6.4210 22.3141 30.5814 53.5671
frequency: 22.1069 30.5588 53.5616 55.2956 62.0442 73.2293 78.9867 100.2847 125.8690 133.2492 169.1385 181.3903 203.8115 243.7509 249.8881 261.1577 281.7817 293.0072 319.2111 341.3788 368.5041 395.7250 397.3222 405.0855 427.7033 438.7966 458.5992 480.0793 496.3713 519.4963 536.9772 590.4352 614.1502 636.8623 638.1648 647.7205 667.9346 679.5257 684.9242 692.5589 701.7314 741.4786 768.2370 778.1408 792.8832 817.8568 832.9003 857.2931 859.7493 866.4694 900.1354 905.7818 945.1765 949.6812 953.1984 965.0789 982.9855 989.0571 992.3870 996.8437 1012.2980 1013.1092 1019.8625 1022.9838 1029.0217 1052.1091 1089.7099 1093.1102 1099.8747 1109.6872 1114.4133 1139.1017 1146.9661 1178.2034 1181.2640 1182.4072 1195.1943 1213.1861 1219.3807 1254.9086 1271.0816 1277.0821 1313.1384 1322.8047 1328.9814 1354.1738 1374.9557 1379.7712 1384.8591 1387.7731 1430.5956 1437.4392 1462.0187 1468.4617 1471.8997 1477.6967 1483.2497 1491.7107 1537.6527 1563.5263 1574.5123 1583.6510 1594.9607 1607.4442 1621.4658 1630.5598 2960.7197 3005.5058 3103.1915 3139.8386 3140.8415 3145.6915 3156.6363 3162.8780 3165.7788 3173.7372 3175.1742 3178.0503 3182.5001 3185.8056 3195.3292 3204.6132 3215.6221
redmass: 3.9208 6.7969 5.3846 5.8461 4.3091 6.8977 5.2252 4.1134 1.1901 3.7126 6.6242 5.0064 5.9326 5.0921 5.2244 5.5877 6.2920 5.1207 6.9836 6.6921 4.2808 2.6773 4.4485 2.9091 8.0614 4.6486 4.7577 4.8865 5.4503 5.4786 4.0556 5.3590 6.4637 6.7145 6.0662 6.1168 4.7277 7.3291 3.5567 2.4854 1.7793 3.0495 2.3522 4.6445 2.3800 3.9106 1.4406 1.2907 1.2712 4.9162 2.0994 2.0333 1.7544 1.3998 2.9365 1.3713 1.4315 4.7299 1.5115 5.0970 5.4605 1.3654 4.3155 1.4437 2.1703 2.2681 1.6986 2.0283 1.6804 1.5947 1.5695 1.9357 4.2287 1.7977 1.0860 1.0673 1.1360 1.2832 1.2611 2.7860 1.7562 1.6058 2.7855 1.5555 2.6261 1.3350 8.9130 3.3482 5.7854 4.9629 1.1868 2.2907 1.1849 2.0954 2.2087 2.0727 2.3755 1.0703 8.5442 8.0018 6.0636 6.2227 6.8199 6.0561 8.7464 5.4074 1.0832 1.0362 1.0985 1.1037 1.0861 1.0881 1.0924 1.0890 1.0965 1.0926 1.0906 1.1017 1.0976 1.0918 1.0954 1.1004 1.0998
irintensity: 0.2286 0.2754 2.1677 1.3598 0.0773 3.5865 0.4670 3.2592 0.8841 2.1348 2.5233 0.7424 3.6518 5.4366 7.5994 1.6062 0.4760 0.9564 1.3131 4.1765 10.9157 0.0953 1.9839 0.5503 2.9465 4.4896 0.4405 2.9943 5.8604 15.1121 17.7979 5.8469 0.1566 8.7189 2.8442 2.6912 16.4069 0.9797 27.1963 54.7018 59.3691 13.3368 28.1256 4.2300 35.7288 11.3390 36.2931 7.7244 7.1097 55.1322 6.1436 5.0282 1.0168 3.3364 8.6725 0.4829 5.3000 10.5078 0.7655 20.9438 1.2830 0.4638 0.6416 0.8760 4.7854 4.0021 11.7812 8.0830 10.6605 76.4145 12.7935 4.5602 91.3918 8.5569 0.8213 2.0899 13.0450 9.0847 10.9482 72.9688 16.5978 78.7078 78.4061 21.6539 24.5515 1.9737 26.8364 4.0959 12.0983 18.6920 27.1923 14.7289 47.6637 82.7084 44.1703 50.1252 5.1275 8.0646 207.4085 60.9266 2.4963 11.0612 17.7641 26.1697 433.7371 12.1538 15.7283 19.0833 9.1041 1.3008 1.7641 0.3017 6.7066 1.7521 14.7786 0.7812 0.8678 12.8351 0.5976 0.2722 0.8673 2.1545 9.0255
temp: 298.150 k
press: 1.00000 atm
elementType: 17 8 7 7 7 6 6 6 6 6 6 6 6 6 6 6 6 6 6 6 6 6 6 6 6 6 1 1 1 1 1 1 1 1 1 1 1 1 1 1 1 1 1
symmnumber: 1
zpe: 869349.4 jmol-1
zpe.correction: 0.331118 hartree
zpe.thermalcorrener: 0.352744 hartree
zpe.thermalcorrenthalpy: 0.353689 hartree
zpe.thermalcorrgfe: 0.278930 hartree
zpe.sumelectzpe: -1507.954602 hartree
zpe.sumelectthermal: -1507.932975 hartree
zpe.sumelectthermalent: -1507.932031 hartree
zpe.sumelectthermalfe: -1508.006789 hartree
dipole: -8.3002 -0.9694 -1.8775
dipole: 8.5649
quadrupole: -80.2721 -113.4881 -144.7143
quadrupole: -1.1817 27.0533 -0.6389
quadrupole: 32.5527 -0.6632 -31.8895 -1.1817 27.0533 -0.6389
hfenergy: -1508.2857193 hartree
pointgroup: C01 [X(C21H17Cl1N3O1)]
dipole: -3.3304199 0.0602247 -0.5094753 debye
polarizability: 355.1774769|-8.1872421|288.9073197|-14.1866525|6.8069185|172.7331959 unknown
InChI: InChI=1S/C21H17ClN3O/c1-24-18-11-10-16(22)14-17(18)19(15-8-4-2-5-9-15)23-20(21(24)26)25-12-6-3-7-13-25/h2-14,20H,1H3
charge 1 multiplicity 1
43 atoms
Cl 4.495247 -2.40406 -2.279903
O  -2.494229 -1.15111 1.876359
N  -0.327678 -1.895001 1.372077
N  -2.842577 0.11488 -0.507317
N  -0.574898 0.757459 -0.056427
C  -1.449682 -0.387018 -0.233718
C  0.788141 -1.970534 0.466047
C  1.329693 -0.813509 -0.189362
C  0.735168 0.550538 -0.043969
C  -1.497432 -1.195585 1.106301
C  1.618979 1.737624 0.089096
C  1.423221 -3.229258 0.294474
C  2.470765 -0.971658 -1.025368
C  -0.298008 -2.697223 2.627594
C  -3.666117 -0.588462 -1.350626
C  -3.292407 1.201484 0.198739
C  2.55119 -3.371079 -0.532222
C  3.058954 -2.23336 -1.195872
C  2.909802 1.632142 0.680756
C  1.154391 3.013928 -0.337085
C  -4.995392 -0.190418 -1.532232
C  -4.618375 1.633983 0.045692
C  -5.483389 0.936033 -0.825619
C  3.714838 2.779109 0.840491
C  1.965194 4.154294 -0.185247
C  3.248094 4.040986 0.405229
H  -1.163715 -1.054477 -1.074375
H  1.025665 -4.111451 0.804128
H  2.883969 -0.099962 -1.539737
H  0.732564 -2.731609 3.011516
H  -0.956554 -2.209446 3.361904
H  -0.670925 -3.72352 2.461949
H  -3.232193 -1.451844 -1.859595
H  -2.553734 1.690247 0.835154
H  3.022992 -4.348586 -0.665174
H  3.273829 0.663824 1.039781
H  0.163153 3.090304 -0.794631
H  -5.633877 -0.755475 -2.214743
H  -4.961409 2.501414 0.613686
H  -6.52086 1.25846 -0.952276
H  4.701398 2.690698 1.306464
H  1.60658 5.130029 -0.52874
H  3.87793 4.928914 0.523303
