program: Gaussian 09
title: 000218614
version: EM64L-G09RevD.01
frameworkgroup: C1[X(C23H28ClFN2O3)]
method: RPBEPBE
basis: SDD
operation: Freq
keyword: #p
keyword: freq=noraman
keyword: PBEPBE/SDD
title: #p freq=noraman PBEPBE/SDD
converged: YES YES NO NO
title: Mulliken charges:
elementType: Cl F O O O N N C C C C C C C C C C C C C C C C C C C C C C C H H H H H H H H H H H H H H H H H H H H H H H H H H H H
charge: -0.042445 -0.197446 -0.457055 -0.288605 -0.225706 -0.105714 -0.094205 -0.373165 -0.367581 -0.371620 -0.367306 -0.379106 -0.344106 -0.123057 -0.443186 -0.502870 -0.306124 0.117313 0.294191 0.507083 -0.309863 -0.320253 -0.318838 -0.330391 -0.387077 -0.371773 0.332206 -0.208491 -0.229220 -0.241680 0.193171 0.206612 0.208316 0.187793 0.217358 0.187434 0.184117 0.206058 0.222653 0.221019 0.193396 0.198235 0.217595 0.221757 0.234472 0.225185 0.270270 0.219752 0.239942 0.365380 0.254967 0.283960 0.256366 0.258878 0.261482 0.255444 0.229771 0.234707
chargesum: 0.00000
title: Mulliken charges with hydrogens summed into heavy atoms:
elementType: Cl F O O O N N C C C C C C C C C C C C C C C C C C C C C C C
charge: -0.042445 -0.197446 -0.091675 -0.288605 -0.225706 -0.105714 -0.094205 0.026619 0.028528 0.033171 0.022869 0.064565 0.047524 0.094538 0.013043 -0.007415 0.153570 0.117313 0.294191 0.507083 -0.054896 -0.036292 -0.318838 -0.074025 -0.128199 -0.110291 0.332206 0.046954 0.000551 -0.006974
polarizability: 3.58432665e+02 -4.66405142e+01 2.63968563e+02 1.13699033e+01 3.41923934e+00 2.30570651e+02
1716.lowfreq: -5.3265 -2.0212 0.0009 0.0016 0.0020 2.0761 4.0330 9.0193 12.8661
frequency: 2.7004 8.9019 12.7233 16.4907 18.5658 33.7960 41.4919 48.2740 60.3919 80.6423 86.2689 98.8542 117.1732 133.8292 137.1770 153.0718 174.4776 203.4954 218.4579 226.9863 244.1892 255.0800 260.3173 274.3470 281.8978 286.4207 314.1743 327.2140 348.3369 374.0894 380.9263 392.7415 411.7329 432.4083 438.9692 443.6450 460.3642 464.1110 477.6952 483.4180 486.9380 514.8725 531.2677 539.2895 568.5186 581.9303 595.0718 612.4515 624.4639 671.7860 706.8036 717.1063 731.0611 750.5218 755.6946 776.7512 799.1457 803.4055 812.1011 822.7638 838.6167 845.9176 849.3988 854.9268 880.9406 908.1876 926.1797 938.2266 946.9818 961.6225 969.4828 976.6703 989.0903 995.9201 1001.8409 1006.8152 1021.1865 1032.3303 1040.0598 1045.1811 1052.1505 1055.7372 1078.3103 1085.1722 1098.8082 1104.6765 1113.8851 1128.7688 1129.5600 1137.3741 1142.6982 1144.7862 1156.0396 1171.5194 1176.0214 1192.9047 1198.1635 1202.3870 1213.9796 1233.1804 1235.3777 1252.5580 1258.4537 1266.1925 1272.0527 1281.0449 1284.5651 1292.3500 1306.1301 1313.3827 1314.4186 1327.5149 1335.5893 1347.8805 1357.4560 1364.1546 1369.7009 1379.6812 1380.4626 1389.3421 1391.2234 1403.4175 1408.8725 1428.8870 1438.7084 1451.6601 1451.9603 1455.7823 1460.1679 1463.6064 1470.7802 1471.9244 1473.9135 1475.4429 1489.9754 1570.9031 1575.2459 1600.9722 1604.2753 1611.8179 2852.2170 2855.2316 2865.6337 2868.6599 2877.9005 2901.8800 2952.9508 2961.6118 2980.4981 3001.7115 3003.0404 3011.6823 3027.4080 3031.8024 3038.6066 3041.3010 3048.2742 3064.3411 3066.5866 3138.9338 3154.8256 3155.7023 3157.2947 3166.6780 3177.2391 3177.8325 3180.4061 3537.3579
redmass: 7.1227 7.2075 6.8931 5.7565 6.0427 3.0182 5.1433 5.5004 5.7435 6.5187 5.3712 4.9766 4.5741 3.6270 3.0172 5.3557 3.7394 3.1790 4.1486 5.1907 3.2895 2.1178 5.4599 2.8286 5.0522 5.7433 2.9962 3.6624 2.2727 6.4619 7.5160 2.2960 2.9526 3.1612 2.9100 1.9915 1.6481 4.3634 2.9835 3.1083 2.9032 3.3154 4.0992 3.8366 2.1880 6.5250 6.0643 2.1561 7.1860 6.7191 3.6345 2.4448 2.9686 1.2723 5.3447 3.0280 5.5886 1.9196 5.1050 1.3218 1.4325 1.5425 1.5485 2.4041 2.0624 1.8979 1.3865 2.1201 1.8003 1.5868 1.3132 6.0977 1.3552 3.7099 2.4740 2.3823 7.0012 2.2654 2.0727 2.1556 1.7979 2.1915 1.8530 2.2180 2.3181 1.3607 2.4505 1.7476 1.5472 2.6993 1.9192 2.7562 1.4174 1.0724 1.4214 1.2021 1.4332 2.2595 1.6386 2.0615 1.7607 1.4786 1.2995 1.5338 1.1548 1.4693 1.4811 1.2815 1.2864 1.3198 1.5155 1.3019 1.3309 1.3172 1.6309 1.4850 1.5035 4.2660 5.9077 1.4511 1.5665 1.6732 4.0055 2.3336 1.1018 1.0967 1.1384 1.1582 1.0931 1.0894 1.0935 1.9890 1.0937 1.1013 2.5718 7.9594 6.3922 7.1851 7.2253 7.2169 1.0711 1.0705 1.0699 1.0703 1.0682 1.0687 1.0611 1.0827 1.0579 1.0883 1.0895 1.0687 1.0909 1.0884 1.0904 1.0905 1.0882 1.1059 1.0997 1.0858 1.0899 1.0884 1.0890 1.0941 1.0964 1.1003 1.0974 1.0655
irintensity: 0.0601 0.3164 0.6999 0.6950 0.2253 0.0629 0.2579 0.2695 1.7741 0.4061 2.1028 2.7411 2.6167 1.7535 4.6753 2.3012 2.0034 1.4837 1.2736 13.0890 1.0526 1.5927 0.6153 1.4815 4.6704 0.2335 5.8199 10.1532 5.1307 3.0949 0.2701 3.9300 0.0578 16.9772 18.1517 45.3337 82.1948 11.0978 15.8416 11.1437 8.3039 16.0790 4.9812 0.6277 9.6636 28.2635 6.6249 0.2655 0.3902 25.8290 0.4343 8.8108 12.8276 103.2182 2.1746 19.8128 14.1802 40.5161 17.1617 1.4299 0.9654 2.8189 50.5984 6.3520 25.5763 9.8862 3.7254 12.6811 12.2891 10.2186 0.2425 96.2329 0.6125 24.3218 68.7991 1.5105 61.7261 30.4506 20.9028 46.2982 0.4120 2.8744 4.8309 4.0008 7.7239 11.6344 14.7990 16.4745 10.2669 29.2689 6.0515 75.4423 87.6692 5.8788 17.5597 3.9422 1.7792 22.3038 83.1617 68.5522 175.4231 56.2068 38.3995 34.3477 7.3851 52.6505 83.1459 1.4934 13.6204 13.9977 77.9816 8.9961 6.4307 2.6696 62.2082 7.5152 1.5320 5.4111 21.6016 2.5198 4.4806 6.5818 17.3165 25.8114 16.1752 16.1163 40.0909 40.2612 10.3533 2.6033 27.7609 75.7432 23.6696 2.3317 26.9325 110.2114 16.6374 76.4261 52.9669 59.0023 73.3865 18.8140 46.9514 5.6294 319.2552 117.7757 70.1672 33.3246 24.3646 23.6504 6.3531 25.4536 37.2383 37.5116 55.2746 45.1219 24.2364 35.3842 42.7597 2.5797 11.3367 6.4953 0.0528 14.3320 4.5270 10.0569 4.2267 18.7483
temp: 298.150 k
press: 1.00000 atm
elementType: 17 9 8 8 8 7 7 6 6 6 6 6 6 6 6 6 6 6 6 6 6 6 6 6 6 6 6 6 6 6 1 1 1 1 1 1 1 1 1 1 1 1 1 1 1 1 1 1 1 1 1 1 1 1 1 1 1 1
symmnumber: 1
zpe: 1230951.0 jmol-1
zpe.correction: 0.468844 hartree
zpe.thermalcorrener: 0.498158 hartree
zpe.thermalcorrenthalpy: 0.499102 hartree
zpe.thermalcorrgfe: 0.400238 hartree
zpe.sumelectzpe: -1786.031115 hartree
zpe.sumelectthermal: -1786.001802 hartree
zpe.sumelectthermalent: -1786.000858 hartree
zpe.sumelectthermalfe: -1786.099721 hartree
dipole: -0.5632 3.8506 3.0351
dipole: 4.9352
quadrupole: -197.5437 -190.0859 -185.7418
quadrupole: -14.7622 6.1160 9.7671
quadrupole: -6.4199 1.0379 5.3820 -14.7622 6.1160 9.7671
hfenergy: -1786.4999594 hartree
pointgroup: C01 [X(C23H28Cl1F1N2O3)]
dipole: -0.313758 0.4292689 1.8674308 debye
polarizability: 360.5140598|-43.7417063|247.1071975|-15.0141076|14.866189|245.3506215 unknown
InChI: InChI=1S/C23H28ClFN2O3/c24-21-4-1-2-6-23(21)30-17-20(28)16-27-14-12-26(13-15-27)11-3-5-22(29)18-7-9-19(25)10-8-18/h1-2,4,6-10,20,28H,3,5,11-17H2
charge 0 multiplicity 1
58 atoms
Cl -7.418206 -0.767719 -3.052745
F  9.28878 -2.252307 -0.917161
O  -3.808063 -3.020057 -1.182595
O  -5.333375 -0.707046 -0.95672
O  4.969235 2.4880 -0.786171
N  -1.292971 -0.946698 0.658403
N  0.993641 0.668259 1.454402
C  -0.438772 -0.262849 -0.348264
C  -0.488595 -1.28047 1.861961
C  0.195813 1.003291 0.248625
C  0.137123 -0.009739 2.458475
C  -1.998201 -2.130669 0.10904
C  1.71909 1.83683 2.017554
C  -3.200728 -1.748972 -0.771707
C  2.91457 2.278185 1.146101
C  3.930197 1.138146 0.959648
C  -4.212924 -0.889087 -0.007709
C  5.006033 1.434168 -0.082041
C  6.119772 0.438613 -0.272482
C  -6.46238 -0.008212 -0.533785
C  6.169683 -0.796478 0.429749
C  7.154766 0.750104 -1.197489
C  -7.55339 0.062338 -1.439674
C  -6.58569 0.631841 0.725518
C  7.226898 -1.705322 0.218265
C  8.220547 -0.141344 -1.420171
C  8.229162 -1.352561 -0.702829
C  -8.732846 0.751614 -1.114887
C  -7.771215 1.325429 1.057001
C  -8.845299 1.390447 0.143545
H  0.375052 -0.940641 -0.710377
H  -1.055493 0.020215 -1.220131
H  -1.151184 -1.751197 2.611778
H  0.330652 -2.003741 1.620242
H  0.853818 1.466116 -0.507752
H  -0.614698 1.736592 0.493202
H  -0.685584 0.659893 2.817379
H  0.761015 -0.282794 3.330225
H  -1.328189 -2.792119 -0.490702
H  -2.380664 -2.737802 0.950844
H  2.09097 1.540916 3.018926
H  1.033273 2.708083 2.172088
H  -2.875164 -1.182486 -1.670278
H  3.40168 3.150036 1.622496
H  2.577572 2.633664 0.15597
H  4.41657 0.893307 1.926356
H  3.373077 0.221997 0.667331
H  -4.575134 -1.42055 0.895107
H  -3.769289 0.083108 0.274647
H  -4.646182 -2.804138 -1.669556
H  5.381617 -1.060513 1.141239
H  7.096075 1.704177 -1.73097
H  -5.760518 0.592803 1.442354
H  7.282025 -2.661586 0.745968
H  9.025664 0.082892 -2.12559
H  -9.5534 0.785371 -1.837776
H  -7.849934 1.815101 2.033438
H  -9.763688 1.927856 0.398881
