program: Gaussian 09
title: 000218592
version: EM64L-G09RevD.01
frameworkgroup: C1[X(C13H12Cl2N2O3)]
method: RPBEPBE
basis: SDD
operation: Freq
keyword: #p
keyword: freq=noraman
keyword: PBEPBE/SDD
title: #p freq=noraman PBEPBE/SDD
converged: YES YES NO NO
title: Mulliken charges:
elementType: Cl Cl O O O N N C C C C C C C C C C C C C H H H H H H H H H H H H
charge: -0.006718 -0.033254 -0.256563 -0.257793 -0.231782 -0.211142 -0.008891 0.194177 0.186552 0.189558 -0.483040 0.173082 -0.315962 -0.772150 -0.275542 0.270503 -0.124123 -0.212953 -0.255990 -0.665878 0.302557 0.266351 0.298615 0.235296 0.252547 0.281042 0.285143 0.232914 0.240163 0.226521 0.245975 0.230785
chargesum: 0.00000
title: Mulliken charges with hydrogens summed into heavy atoms:
elementType: Cl Cl O O O N N C C C C C C C C C C C C C
charge: -0.006718 -0.033254 -0.256563 -0.257793 -0.231782 -0.211142 -0.008891 0.194177 0.186552 0.189558 0.085868 0.173082 -0.017346 -0.003265 -0.275542 0.270503 -0.124123 0.072190 0.217087 0.037403
polarizability: 2.62426236e+02 1.10184153e+01 1.97028375e+02 -3.15023354e+01 2.80323019e+00 1.18806308e+02
1716.lowfreq: -7.9984 -4.9087 -0.7041 -0.0010 0.0013 0.0016 18.1234 20.1405 27.8418
frequency: 17.9940 19.9949 27.7339 57.9528 62.7671 85.8631 111.3090 122.9518 153.5194 166.6855 168.1951 192.7539 196.8630 212.5247 264.6599 298.5890 304.1148 316.5737 331.4353 359.5249 377.3787 391.1511 397.8819 408.2240 492.3960 525.4318 528.2178 554.2611 562.7032 577.0643 621.1538 632.3331 654.9782 707.4974 732.2605 760.9763 780.6079 798.3610 818.3692 850.2295 876.4275 881.7218 896.7066 919.4018 998.3239 1002.1435 1014.0629 1044.4366 1072.8901 1081.6614 1095.3323 1154.1389 1156.9610 1186.2705 1200.4442 1216.3543 1253.6988 1273.8183 1278.0742 1310.7046 1356.3381 1360.4695 1382.8341 1390.3598 1393.7652 1404.6778 1425.7651 1429.4777 1453.1839 1458.4009 1463.7957 1475.5655 1483.3413 1540.0637 1565.3930 1595.1382 1613.9152 1637.9196 2990.6013 2993.8300 3010.3288 3035.9463 3069.6178 3089.2970 3095.3755 3095.5609 3124.5876 3137.0118 3178.5520 3182.3675
redmass: 3.8967 5.6229 6.4287 6.4198 4.5824 4.1018 5.5583 7.0725 5.2584 5.6591 2.9911 2.8857 1.7026 1.5549 2.8334 5.4784 8.2693 4.2345 3.4777 4.6323 6.3357 3.9926 6.0302 4.2241 5.4291 7.1545 5.2494 4.1545 4.6808 6.9426 3.9401 4.7642 5.1014 7.9468 5.1689 4.1487 3.8639 5.6777 1.6663 5.3232 1.4332 3.6701 3.0194 1.4330 4.2185 2.1537 2.9452 1.5782 2.5394 1.8874 2.1927 3.1722 1.8803 4.3022 3.4957 2.4713 2.4318 2.0399 1.1520 1.7234 1.3328 1.8526 7.3794 1.2542 1.2876 4.1353 1.2565 2.5222 1.1567 1.0989 1.0451 1.0467 1.0528 8.8976 7.1215 8.3567 10.7767 9.8743 1.0394 1.0359 1.0638 1.0602 1.0971 1.0974 1.0965 1.1023 1.1072 1.0974 1.0931 1.0935
irintensity: 1.1226 0.0712 0.5810 2.2198 1.8583 0.8177 0.7738 0.2699 2.3927 0.6575 2.0978 2.5444 1.3624 1.5188 1.3319 1.0112 6.1454 5.9319 2.0020 7.4188 0.6944 14.8134 4.1239 2.6516 4.7700 3.6351 7.8101 7.7966 6.5208 0.7695 6.1132 13.0867 16.6651 7.5054 25.9379 55.2569 24.6023 16.0298 5.2079 14.7322 21.1541 21.7812 30.6148 10.7780 34.7153 8.4210 81.6373 6.2779 10.3337 1.4757 20.6292 19.0973 30.2312 190.0637 52.1332 49.2289 2.7792 3.9371 7.4427 67.3047 14.6039 79.6459 40.3432 6.2129 51.1561 31.9146 63.6127 80.2373 21.4131 13.0919 14.5940 24.2342 16.9778 44.2984 240.3527 39.0438 337.9672 224.0951 12.6855 12.5479 39.6736 22.4183 11.2423 34.7634 3.9503 3.6124 21.1792 3.5256 5.6288 0.3111
temp: 298.150 k
press: 1.00000 atm
elementType: 17 17 8 8 8 7 7 6 6 6 6 6 6 6 6 6 6 6 6 6 1 1 1 1 1 1 1 1 1 1 1 1
symmnumber: 1
zpe: 604057.5 jmol-1
zpe.correction: 0.230073 hartree
zpe.thermalcorrener: 0.249522 hartree
zpe.thermalcorrenthalpy: 0.250466 hartree
zpe.thermalcorrgfe: 0.179037 hartree
zpe.sumelectzpe: -1756.455598 hartree
zpe.sumelectthermal: -1756.436150 hartree
zpe.sumelectthermalent: -1756.435205 hartree
zpe.sumelectthermalfe: -1756.506635 hartree
dipole: 2.3606 1.7994 0.9189
dipole: 3.1072
quadrupole: -131.5083 -140.6302 -120.6491
quadrupole: 6.4700 6.2133 -3.3124
quadrupole: -0.5791 -9.7010 10.2801 6.4700 6.2133 -3.3124
hfenergy: -1756.6856715 hartree
pointgroup: C01 [X(C13H12Cl2N2O3)]
dipole: -0.8345673 -0.5580388 0.6974837 debye
polarizability: 261.4335471|27.3440071|184.7874849|16.3895264|-32.2870067|132.0398866 unknown
InChI: InChI=1S/C13H12Cl2N2O3/c1-3-20-11(18)6-17-7(2)16-12-9(13(17)19)4-8(14)5-10(12)15/h4-5H,3,6H2,1-2H3
charge 0 multiplicity 1
32 atoms
Cl 3.454102 -2.379705 1.38985
Cl 4.970254 2.56853 -0.563681
O  -2.617399 0.697558 0.87517
O  -0.32156 1.818866 -1.801085
O  -4.493013 0.29087 -0.458886
N  -0.874138 -0.297265 -0.943491
N  0.726712 -1.675949 0.206455
C  1.40618 0.544226 -0.664731
C  -0.497589 -1.470088 -0.259067
C  0.046759 0.77665 -1.183464
C  -2.258793 -0.071946 -1.393736
C  1.691603 -0.682402 0.01973
C  2.392667 1.544976 -0.850677
C  -1.535014 -2.545945 -0.054043
C  3.019985 -0.85914 0.514111
C  -3.253558 0.306172 -0.290916
C  3.674499 1.313073 -0.34561
C  4.008531 0.118784 0.340132
C  -3.497965 1.149213 2.005151
C  -3.952474 -0.044155 2.847874
H  -2.22301 0.777608 -2.102123
H  -2.657061 -0.948908 -1.927549
H  2.125192 2.463655 -1.379398
H  -1.909726 -2.948787 -1.013412
H  -2.404272 -2.173876 0.517505
H  -1.06225 -3.362435 0.509065
H  5.018255 -0.038916 0.726958
H  -2.848787 1.836235 2.56968
H  -4.356315 1.695532 1.576923
H  -4.513993 0.320167 3.727832
H  -4.61841 -0.706783 2.269811
H  -3.08681 -0.624312 3.211818
