program: Gaussian 09
title: 000218588
version: EM64L-G09RevD.01
frameworkgroup: C1[X(C13H13BrN2O3)]
method: RPBEPBE
basis: SDD
operation: Freq
keyword: #p
keyword: freq=noraman
keyword: PBEPBE/SDD
title: #p freq=noraman PBEPBE/SDD
converged: YES YES NO NO
title: Mulliken charges:
elementType: Br O O O N N C C C C C C C C C C C C C H H H H H H H H H H H H H
charge: 0.021590 -0.254271 -0.261076 -0.233774 -0.213216 -0.045278 0.160968 0.177273 -0.480161 0.186782 0.050954 -0.257220 -0.772101 -0.341005 0.267699 -0.246187 -0.153089 -0.256015 -0.666406 0.300981 0.264524 0.289222 0.234126 0.252503 0.275513 0.267818 0.256505 0.232613 0.239540 0.225477 0.245159 0.230552
chargesum: 0.00000
title: Mulliken charges with hydrogens summed into heavy atoms:
elementType: Br O O O N N C C C C C C C C C C C C C
charge: 0.021590 -0.254271 -0.261076 -0.233774 -0.213216 -0.045278 0.160968 0.177273 0.085344 0.186782 0.050954 0.032002 -0.009959 -0.073187 0.267699 -0.246187 0.103416 0.216139 0.034782
polarizability: 2.82429068e+02 1.52659645e+01 1.60976108e+02 -2.53186431e+01 1.87913323e+01 1.22988882e+02
1716.lowfreq: -7.3499 -5.4039 0.0006 0.0008 0.0009 3.4936 22.5965 30.4385 37.4783
frequency: 22.4970 30.1733 37.4503 60.8421 69.0019 90.7051 114.6495 133.9826 154.6535 162.8946 202.1831 207.9283 234.4837 269.6326 298.1129 317.1675 326.9619 345.0600 356.8631 379.6075 401.8758 442.4527 491.4736 510.1625 538.3548 554.5431 564.3298 609.5006 624.9828 650.8072 661.0301 697.9974 729.5754 768.5421 790.1322 819.0781 843.2383 847.9793 868.6794 894.9078 927.3712 976.9236 982.5512 1002.3956 1015.2561 1046.2091 1054.7806 1075.4953 1095.9255 1115.9644 1156.4935 1166.8534 1193.5068 1209.5028 1229.6069 1266.4364 1275.7711 1277.8701 1311.1274 1356.6315 1363.0333 1387.1416 1390.6743 1394.2815 1412.6888 1428.7439 1448.2530 1454.8283 1459.0910 1465.1187 1474.7610 1484.5947 1548.3545 1561.9157 1603.4235 1616.2847 1636.5221 2990.7138 2993.3476 3003.2284 3035.2999 3069.7025 3088.7936 3093.1355 3095.6904 3124.3727 3135.4809 3160.3574 3171.5439 3180.2281
redmass: 5.8295 4.4586 5.5013 6.4609 3.7207 3.8854 5.3956 5.4532 6.4271 2.0850 1.4843 1.5127 6.3919 2.5367 4.3895 3.9720 4.1563 3.2713 5.3994 3.6917 3.8220 3.4657 5.8338 4.8709 3.8086 7.4673 4.8760 5.1971 3.9982 4.7809 6.4665 5.9916 4.8030 2.7108 3.7929 1.5435 1.6120 5.2953 3.5365 3.0898 1.4512 1.3528 4.1147 2.0392 2.9362 1.5675 2.0533 2.6337 2.1938 1.8544 1.6643 3.3272 4.1310 3.4874 1.9995 1.6130 1.9181 1.2122 1.7523 1.2995 1.8801 8.8158 1.2413 1.2918 3.6912 1.1147 1.8576 1.4154 1.1036 1.0451 1.0470 1.0522 8.2562 6.8956 7.7216 10.4348 9.7651 1.0393 1.0360 1.0643 1.0602 1.0971 1.0975 1.0958 1.1023 1.1071 1.0974 1.0886 1.0930 1.0978
irintensity: 0.1687 1.1130 1.2568 1.9334 0.9781 0.8550 0.4416 1.8226 0.9276 1.8357 0.3290 2.6087 2.2472 1.5672 3.7370 6.3162 4.9630 3.2062 4.7417 18.9117 2.6592 0.8118 6.4108 6.9493 12.8290 5.1672 7.3252 22.0856 6.6063 6.9914 12.5555 7.0068 13.9584 10.7009 1.4316 4.0865 48.6220 22.6374 23.3183 32.7999 8.8169 1.3572 11.1948 7.6915 86.9074 5.2581 16.7164 5.2548 21.2112 11.6055 9.1240 62.4161 167.3450 90.7277 3.9633 9.7806 6.1739 7.5350 57.4388 6.0706 86.4790 35.7168 8.0392 45.1888 2.9439 54.6728 66.8009 72.8012 12.8201 14.5922 23.4902 17.2641 2.3724 211.8444 42.4514 344.1180 211.6186 13.7800 13.4245 49.4565 23.0736 12.3877 35.8400 5.0414 3.1809 21.8355 4.6152 0.8891 2.0367 5.9818
temp: 298.150 k
press: 1.00000 atm
elementType: 35 8 8 8 7 7 6 6 6 6 6 6 6 6 6 6 6 6 6 1 1 1 1 1 1 1 1 1 1 1 1 1
symmnumber: 1
zpe: 628833.6 jmol-1
zpe.correction: 0.239510 hartree
zpe.thermalcorrener: 0.257741 hartree
zpe.thermalcorrenthalpy: 0.258685 hartree
zpe.thermalcorrgfe: 0.190396 hartree
zpe.sumelectzpe: -850.470322 hartree
zpe.sumelectthermal: -850.452090 hartree
zpe.sumelectthermalent: -850.451146 hartree
zpe.sumelectthermalfe: -850.519436 hartree
dipole: 2.2288 2.4171 2.0573
dipole: 3.8784
quadrupole: -120.4817 -120.9003 -115.2034
quadrupole: 0.9671 6.1541 -6.1326
quadrupole: -1.6199 -2.0385 3.6584 0.9671 6.1541 -6.1326
hfenergy: -850.7098318 hartree
pointgroup: C01 [X(C13H13Br1N2O3)]
dipole: -0.6184509 0.5799568 -1.2686595 debye
polarizability: 275.808476|-39.4186183|146.6617896|1.4015206|-30.4508496|143.9237927 unknown
InChI: InChI=1S/C13H13BrN2O3/c1-3-19-12(17)7-16-8(2)15-11-5-4-9(14)6-10(11)13(16)18/h4-6H,3,7H2,1-2H3
charge 0 multiplicity 1
32 atoms
Br 5.467127 -1.782886 1.028152
O  -2.442111 -1.042364 -0.527634
O  0.038735 -0.990042 2.223797
O  -4.305974 -0.23369 0.627612
N  -0.721543 0.652929 0.724332
N  0.716372 1.676994 -0.912068
C  1.612892 -0.057438 0.62165
C  -0.471001 1.54958 -0.335412
C  -2.066835 0.495927 1.303956
C  0.299045 -0.201816 1.266845
C  1.773735 0.87598 -0.44988
C  2.703273 -0.850075 1.066315
C  -1.608246 2.412013 -0.826624
C  3.049228 0.999646 -1.068718
C  -3.069518 -0.273899 0.439447
C  3.943028 -0.701637 0.434429
C  4.130276 0.217995 -0.633262
C  -3.326926 -1.89277 -1.392338
C  -3.831001 -1.096108 -2.597544
H  -1.933041 -0.08146 2.239387
H  -2.513973 1.469107 1.560392
H  2.542215 -1.552945 1.888628
H  -1.997181 3.077571 -0.03371
H  -2.453653 1.806703 -1.200459
H  -1.225648 3.031698 -1.649542
H  3.161775 1.716279 -1.887124
H  5.110511 0.313365 -1.108929
H  -2.667104 -2.723425 -1.687013
H  -4.161493 -2.265272 -0.773123
H  -4.39563 -1.765797 -3.272229
H  -4.506742 -0.284064 -2.280127
H  -2.988792 -0.667197 -3.167708
