program: Gaussian 09
title: 000218558
version: EM64L-G09RevD.01
frameworkgroup: C1[X(C22H28N2O4S)]
method: RPBEPBE
basis: SDD
operation: Freq
keyword: #p
keyword: freq=noraman
keyword: PBEPBE/SDD
title: #p freq=noraman PBEPBE/SDD
converged: YES YES NO NO
title: Mulliken charges:
elementType: S O O O O N N C C C C C C C C C C C C C C C C C C C C C C H H H H H H H H H H H H H H H H H H H H H H H H H H H H
charge: 0.972936 -0.262937 -0.245978 -0.521046 -0.528324 -0.461559 -0.112625 -0.062894 -0.456998 -0.352077 -0.362983 -0.158493 -0.338208 -0.350766 0.420755 -0.320105 -0.315900 -0.038770 -0.390063 -0.401912 -0.223593 -0.263231 -0.227164 -0.239395 -0.239534 -0.365898 -0.371872 0.451594 -0.798468 0.218833 0.252410 0.253022 0.264020 0.242764 0.208680 0.232530 0.266112 0.206587 0.195381 0.191726 0.219349 0.215522 0.190692 0.191553 0.215549 0.265106 0.290130 0.265937 0.297076 0.225746 0.230130 0.227957 0.244971 0.246011 0.244319 0.231799 0.231593
chargesum: 0.00000
title: Mulliken charges with hydrogens summed into heavy atoms:
elementType: S O O O O N N C C C C C C C C C C C C C C C C C C C C C C
charge: 0.972936 -0.262937 -0.245978 -0.521046 -0.528324 -0.461559 -0.112625 0.155939 0.048435 0.154707 0.078227 0.107620 0.063760 0.060309 0.420755 0.086109 0.091202 -0.038770 -0.124957 -0.111781 0.042345 0.033846 -0.001417 -0.009266 -0.011577 -0.120927 -0.125861 0.451594 -0.090756
polarizability: 2.97348214e+02 -1.61479810e+01 3.18674612e+02 2.72916646e+00 -1.02640771e+01 2.39515860e+02
1716.lowfreq: -21.3639 -9.1715 -6.2570 -3.6250 -0.0002 0.0013 0.0015 6.8486 19.9683
frequency: -21.3332 -2.1972 19.8715 22.7757 33.8086 36.3875 42.8233 49.4832 62.0105 83.4259 95.4648 118.7765 123.6169 143.7998 151.8759 184.6717 192.3932 205.4727 217.0741 221.1720 236.7601 239.9705 247.2989 292.4087 301.1659 317.6243 334.3259 349.1085 381.3199 381.8309 396.2082 404.5686 406.9266 408.9055 412.3599 452.1520 467.2827 475.0957 492.5301 507.6290 529.8696 580.2888 597.2323 599.3544 613.7639 621.8729 630.3401 707.0429 709.8870 739.6822 757.7510 765.8247 776.1730 787.6214 803.8239 807.9978 818.8790 824.6379 837.8920 845.2900 851.1969 868.5714 885.0551 896.8297 921.3835 929.9035 947.2439 959.9367 967.4674 976.1727 983.4549 988.2659 989.9602 994.2131 994.7688 996.8618 1003.9332 1014.8886 1027.1180 1027.6105 1049.4141 1052.2688 1052.3694 1072.0843 1085.2774 1086.3844 1106.8863 1110.2513 1118.2630 1131.7634 1151.7725 1159.1342 1170.3079 1183.3938 1188.3844 1192.5862 1199.9367 1205.9026 1217.8772 1227.4153 1250.4490 1261.9603 1267.0665 1274.8974 1292.9691 1295.0173 1301.9932 1311.5999 1319.5864 1327.7431 1328.8944 1338.1761 1346.8164 1348.4886 1363.6096 1370.0094 1380.5762 1381.1517 1381.7010 1390.9914 1399.4633 1433.1668 1442.4298 1447.7304 1449.9064 1453.8021 1458.6555 1470.4483 1472.2181 1473.7836 1474.1831 1480.6765 1496.6888 1590.6878 1594.4347 1595.7786 1610.0160 2863.8742 2871.8265 2904.4245 2952.1784 2956.9578 2972.1223 2981.4399 3000.7181 3006.5683 3021.3509 3027.7738 3032.0848 3057.5539 3060.9033 3064.1972 3080.6433 3083.3723 3084.2752 3093.9863 3109.9490 3124.4912 3136.1273 3137.7849 3138.4207 3153.4507 3160.4823 3164.6858 3164.8582
redmass: 1.0108 5.5760 5.4622 4.3609 3.6771 4.2620 3.8309 4.3421 6.2499 4.4308 3.8461 5.3829 5.2510 3.5390 6.9742 3.0224 5.5774 2.9910 5.9919 8.2821 3.5041 2.4089 5.9948 4.9785 2.4549 4.6740 2.4972 4.8284 2.0621 4.1097 7.8146 3.9061 2.9708 3.8693 2.4024 5.5220 2.7511 4.5425 5.5194 3.1964 6.4419 5.4808 3.8872 2.7533 6.4246 6.9410 3.0694 3.3374 2.3739 1.5821 3.3499 4.0892 4.3234 3.1473 8.1648 3.7378 2.2509 1.3800 1.7103 2.8652 1.2953 1.2489 2.7400 2.5453 3.3170 6.4058 1.5511 1.3243 3.0657 2.7866 1.3814 4.1927 1.5931 1.8478 2.5875 2.4865 1.3944 2.3656 2.1801 2.1960 1.6102 2.1579 2.2176 2.4526 1.6250 2.8438 2.2453 1.9827 1.2886 2.5349 2.2844 4.0483 1.0897 1.1483 1.0684 1.2411 2.2987 1.4772 3.0074 1.1587 1.4307 1.2262 1.2642 1.3729 1.2840 1.2656 1.2794 1.2920 1.3781 1.3041 1.2883 1.2701 1.3373 1.3914 1.3741 1.2748 1.5182 6.2260 5.5042 3.0679 1.2218 2.1950 1.0824 1.0791 1.0958 1.0837 1.0958 1.0983 2.2427 1.1145 1.0670 2.1349 1.0782 6.1245 6.3212 6.5965 5.7889 1.0703 1.0692 1.0697 1.0666 1.0667 1.0655 1.0391 1.0835 1.0765 1.0696 1.0893 1.0902 1.0973 1.0907 1.0947 1.0961 1.1025 1.0978 1.1001 1.0903 1.0862 1.0890 1.0918 1.0891 1.0953 1.0957 1.0968 1.0993
irintensity: 0.5171 1.5319 0.2534 0.1616 0.0982 0.9036 0.1784 0.2461 0.7394 1.3003 1.8678 1.5756 4.3874 1.6158 0.7529 4.6926 0.0904 7.4236 2.8206 11.0881 5.7690 5.2225 1.5781 5.1189 9.9088 2.8561 1.9926 19.5506 1.4441 6.8666 10.7846 3.3958 0.5682 3.4710 7.0856 74.3739 1.0215 27.5089 5.8021 74.5837 17.8478 5.8950 32.6478 16.8708 0.3834 0.2735 27.5915 1.6967 25.1858 52.1865 1.3194 41.6805 11.1982 11.3086 112.8162 13.9546 4.9064 27.3304 3.1320 18.2985 9.6069 0.1389 75.2068 4.7641 31.1014 77.4088 9.9479 1.7165 58.9931 88.6811 1.9956 1.8151 2.3588 7.3394 1.0757 15.6500 3.8969 15.0303 12.2307 4.4747 19.3936 20.6909 24.7239 42.0738 9.2479 46.8522 2.9571 4.1979 8.1667 84.5237 3.6898 28.9205 6.0290 10.5633 1.7726 25.4252 45.9736 29.3082 6.5902 3.0694 20.2320 3.5588 16.9790 17.8929 2.3349 2.3484 7.0625 18.8949 0.7398 2.3218 2.0223 11.2435 9.1315 4.3665 2.1485 1.9271 0.8631 0.7063 0.2670 9.9671 17.1752 13.7402 2.4413 0.5885 17.3422 5.8517 5.4032 16.2973 17.4319 16.0840 13.3013 14.8969 28.1044 0.5599 8.7684 4.3494 3.1496 45.9089 92.2185 76.1957 31.7830 95.2844 46.2934 22.1916 8.8164 20.3683 26.9290 37.9048 37.4475 6.5956 30.3193 19.3773 39.4277 28.3868 29.1294 14.0104 5.2440 1.7087 10.4119 12.3667 8.5124 29.5324 4.0861 13.4288 22.4341
temp: 298.150 k
press: 1.00000 atm
elementType: 16 8 8 8 8 7 7 6 6 6 6 6 6 6 6 6 6 6 6 6 6 6 6 6 6 6 6 6 6 1 1 1 1 1 1 1 1 1 1 1 1 1 1 1 1 1 1 1 1 1 1 1 1 1 1 1 1
symmnumber: 1
zpe: 1215025.3 jmol-1
zpe.correction: 0.462779 hartree
zpe.thermalcorrener: 0.489304 hartree
zpe.thermalcorrenthalpy: 0.490249 hartree
zpe.thermalcorrgfe: 0.404281 hartree
zpe.sumelectzpe: -1661.203310 hartree
zpe.sumelectthermal: -1661.176784 hartree
zpe.sumelectthermalent: -1661.175840 hartree
zpe.sumelectthermalfe: -1661.261808 hartree
dipole: -0.2225 1.3935 -4.5233
dipole: 4.7383
quadrupole: -194.2898 -152.6265 -189.7597
quadrupole: 7.8571 -10.1656 -9.6669
quadrupole: -15.3978 26.2655 -10.8677 7.8571 -10.1656 -9.6669
hfenergy: -1661.6660886 hartree
pointgroup: C01 [X(C22H28N2O4S1)]
dipole: -0.2227844 -0.0557627 1.8500013 debye
polarizability: 288.7521037|0.4479079|312.5877848|-1.0217012|34.4674593|254.1987972 unknown
InChI: InChI=1S/C22H28N2O4S/c1-18-7-9-21(10-8-18)29(25,26)24-12-11-20(17-23-13-15-27-16-14-23)28-22(24)19-5-3-2-4-6-19/h2-10,20,22H,11-17H2,1H3
charge 0 multiplicity 1
57 atoms
S  -1.698267 0.599218 -1.839148
O  0.470248 -1.01184 1.055329
O  5.567577 3.216035 0.989292
O  -2.802236 -0.385581 -2.535464
O  -0.975122 1.760956 -2.723417
N  -0.305357 -0.314497 -1.09176
N  3.228705 1.538602 0.581914
C  1.786911 -0.514778 0.547645
C  2.05228 -0.924929 -0.915015
C  0.937796 -0.433614 -1.887942
C  1.856178 1.015224 0.781999
C  -0.524631 -1.272187 -0.006983
C  4.093856 1.381146 1.780207
C  3.260061 2.947575 0.109266
C  -0.506041 -2.750928 -0.442981
C  5.531164 1.819721 1.45397
C  4.708198 3.363502 -0.198112
C  -2.525502 1.360062 -0.326048
C  0.113069 -3.73257 0.368057
C  -1.171375 -3.144285 -1.631352
C  -1.930028 2.487734 0.260963
C  -3.74101 0.810351 0.108981
C  0.08398 -5.093413 -0.012712
C  -1.199649 -4.505757 -2.008616
C  -0.570706 -5.48417 -1.203747
C  -2.586882 3.0774 1.361439
C  -4.37636 1.417794 1.215403
C  -3.808816 2.548414 1.859697
C  -4.486169 3.175021 3.064034
H  2.527922 -1.014527 1.199925
H  2.134154 -2.023833 -0.972321
H  3.022226 -0.488345 -1.213159
H  1.166924 0.563141 -2.301331
H  0.836587 -1.143671 -2.733141
H  1.466737 1.222693 1.806915
H  1.174796 1.510883 0.069156
H  -1.498779 -1.043053 0.467147
H  4.098816 0.321762 2.097671
H  3.709629 1.991816 2.636068
H  2.836954 3.648105 0.872735
H  2.650829 3.032848 -0.810266
H  6.170218 1.791506 2.352058
H  5.954935 1.152975 0.671891
H  5.105298 2.738516 -1.027153
H  4.767481 4.42905 -0.474725
H  0.610117 -3.417318 1.290993
H  -1.674873 -2.391743 -2.252128
H  -1.001773 2.903714 -0.143051
H  -4.180307 -0.042622 -0.418741
H  0.567703 -5.846462 0.619979
H  -1.71412 -4.801213 -2.930051
H  -0.593458 -6.539104 -1.500028
H  -2.14809 3.961996 1.836865
H  -5.327124 1.010091 1.57693
H  -4.083919 2.750641 4.004276
H  -4.321239 4.265862 3.100846
H  -5.574217 2.991591 3.05984
