program: Gaussian 09
title: 000218557
version: EM64L-G09RevD.01
frameworkgroup: C1[X(C10H12N2O3)]
method: RPBEPBE
basis: SDD
operation: Freq
keyword: #p
keyword: freq=noraman
keyword: PBEPBE/SDD
title: #p freq=noraman PBEPBE/SDD
converged: YES YES NO NO
title: Mulliken charges:
elementType: O O O N N C C C C C C C C C C H H H H H H H H H H H H
charge: -0.262525 -0.210205 -0.210967 -0.106005 0.025611 -0.219110 -0.454499 -0.311534 0.402042 -0.633163 -0.348990 -0.357940 -0.350140 -0.352700 0.375713 0.257362 0.255729 0.239526 0.219719 0.219058 0.225181 0.230922 0.236047 0.279057 0.281585 0.285481 0.284746
chargesum: 0.00000
title: Mulliken charges with hydrogens summed into heavy atoms:
elementType: O O O N N C C C C C C C C C C
charge: -0.262525 -0.210205 -0.210967 -0.106005 0.025611 0.038252 0.040755 0.127243 0.402042 0.058987 -0.069933 -0.076355 -0.064658 -0.067954 0.375713
polarizability: 1.91009394e+02 2.21101344e+00 1.28967636e+02 6.70473259e+00 -4.58339073e+00 8.12783964e+01
1716.lowfreq: -16.3807 -6.5316 -0.0011 -0.0008 -0.0007 3.3849 30.2323 43.1701 67.7118
frequency: 30.0794 43.1027 67.7034 79.1518 107.3033 137.9347 178.9952 194.5566 242.7876 266.9557 298.9962 359.4894 411.9073 432.9763 453.6758 490.8105 510.5224 621.9455 643.6523 650.4885 672.3561 702.7504 723.2344 766.7395 782.3975 814.1265 836.5554 865.1425 868.4936 900.6148 917.1307 955.0198 997.7131 1007.8230 1008.4335 1017.6793 1045.5118 1090.7921 1102.5174 1117.9710 1125.2009 1162.5886 1167.9539 1172.7927 1205.4997 1221.5342 1234.5541 1268.6214 1286.0470 1305.0827 1310.0208 1335.5419 1361.7316 1400.8012 1409.8429 1430.7423 1464.4199 1471.8584 1472.7888 1478.7374 1489.0075 1594.4100 1606.0972 2931.4613 3005.0295 3024.1317 3037.4018 3049.3648 3064.6642 3095.8590 3105.0525 3157.6205 3163.4765 3182.3369 3185.9408
redmass: 4.7066 3.5373 6.2354 3.7178 3.6507 3.2211 1.3720 2.8040 7.0995 5.1767 4.2217 3.0716 2.9524 4.7511 3.8167 4.2371 6.3166 7.0323 3.9384 5.8226 5.4866 6.1733 4.3481 2.9579 6.4386 2.3171 2.5860 1.2750 3.5419 2.5741 3.2766 3.5554 1.4956 1.3538 2.4766 1.9100 2.2068 3.3785 1.2873 1.3852 1.6376 1.3922 1.2972 1.4358 2.8944 5.2233 1.4770 1.4977 1.2685 1.2317 1.2345 1.6694 6.9592 9.9996 3.9495 1.1700 1.0918 1.4776 1.4408 1.0575 1.0823 8.2648 6.3631 1.0470 1.0564 1.0645 1.0864 1.0851 1.1080 1.1019 1.1048 1.0894 1.0892 1.0952 1.0965
irintensity: 0.2092 2.5980 0.0099 3.1498 0.7907 2.5688 3.1970 5.3277 4.9015 1.4833 4.1996 3.3907 0.0226 9.8467 4.6008 6.2680 0.3077 0.2312 11.7541 0.5961 16.4383 16.2590 17.0942 69.1719 16.1530 35.7346 14.7625 0.1139 3.0243 76.7165 2.1361 19.2628 5.9820 0.2065 7.0985 20.6043 46.0361 17.9688 8.2922 11.0039 10.0045 2.6165 5.6756 7.0740 104.9598 272.6544 1.1870 2.8424 0.4488 4.6619 1.8482 34.2533 78.5956 1.3012 71.9605 5.7114 14.1306 8.9807 12.9679 9.6177 4.0434 1.1607 38.2442 84.2400 64.7215 32.8949 5.2059 30.9418 25.1167 16.7414 50.5349 1.6608 0.9365 0.0906 0.9404
temp: 298.150 k
press: 1.00000 atm
elementType: 8 8 8 7 7 6 6 6 6 6 6 6 6 6 6 1 1 1 1 1 1 1 1 1 1 1 1
symmnumber: 1
zpe: 552640.3 jmol-1
zpe.correction: 0.210490 hartree
zpe.thermalcorrener: 0.224027 hartree
zpe.thermalcorrenthalpy: 0.224971 hartree
zpe.thermalcorrgfe: 0.168639 hartree
zpe.sumelectzpe: -722.211219 hartree
zpe.sumelectthermal: -722.197682 hartree
zpe.sumelectthermalent: -722.196737 hartree
zpe.sumelectthermalfe: -722.253069 hartree
dipole: -6.9446 -0.8306 0.4306
dipole: 7.0074
quadrupole: -104.9416 -88.1910 -84.1556
quadrupole: 5.3504 -5.4479 2.4448
quadrupole: -12.5122 4.2384 8.2738 5.3504 -5.4479 2.4448
hfenergy: -722.4217084 hartree
pointgroup: C01 [X(C10H12N2O3)]
dipole: 2.7117778 -0.3441117 -0.3583398 debye
polarizability: 184.5030293|-26.6131037|87.9221991|-4.1279734|-4.776015|128.8301975 unknown
InChI: InChI=1S/C10H12N2O3/c1-11-6-7-15-10(11)8-2-4-9(5-3-8)12(13)14/h2-5,10H,6-7H2,1H3
charge 0 multiplicity 1
27 atoms
O  2.488712 -0.864836 1.381402
O  -4.281085 0.876824 1.026412
O  -4.103924 1.238919 -1.218177
N  2.726789 -0.507799 -0.963175
N  -3.619616 0.855617 -0.083191
C  1.849935 -1.126277 0.032753
C  3.136882 0.766867 -0.296737
C  3.252386 0.404166 1.224923
C  0.424825 -0.567692 0.007204
C  3.865935 -1.370193 -1.377947
C  -0.343794 -0.530349 1.198316
C  -0.151133 -0.134707 -1.213907
C  -1.672637 -0.065113 1.17776
C  -1.477597 0.336839 -1.252726
C  -2.22081 0.362409 -0.05216
H  1.837205 -2.224927 -0.080593
H  2.348424 1.523261 -0.453061
H  4.076691 1.143852 -0.729359
H  4.290982 0.205416 1.543154
H  2.80979 1.184761 1.869466
H  4.517602 -1.690274 -0.535168
H  4.479623 -0.82191 -2.112349
H  3.473328 -2.272902 -1.876425
H  0.121654 -0.85156 2.134867
H  0.46431 -0.161201 -2.1185
H  -2.285096 -0.02387 2.082247
H  -1.943086 0.680979 -2.18003
