program: Gaussian 09
title: 000019290
version: EM64L-G09RevD.01
frameworkgroup: C1[X(C13H11N)]
method: RPBEPBE
basis: SDD
operation: Freq
keyword: #pfreq=noraman
keyword: PBEPBE/SDD
title: #p freq=noraman PBEPBE/SDD
converged: YES YES NO NO
title: Mulliken charges:
elementType: N C C C C C C C C C C C C C H H H H H H H H H H H
charge: -0.489039 0.171940 0.191768 0.242289 0.217519 -0.575608 -0.395858 0.497956 -0.400011 -0.368672 -0.383912 -0.255208 -0.216743 -0.818463 0.301830 0.236517 0.231834 0.232840 0.230829 0.224485 0.221506 0.221554 0.220733 0.229529 0.230387
chargesum: 0.00000
title: Mulliken charges with hydrogens summed into heavy atoms:
elementType: N C C C C C C C C C C C C C
charge: -0.187209 0.171940 0.191768 0.242289 0.217519 -0.339091 -0.164024 0.497956 -0.167172 -0.137843 -0.159427 -0.033703 0.004810 -0.137814
polarizability: 2.54099507e+02 1.82797797e+00 1.44930474e+02 4.02171709e-02 -1.16310965e-02 6.20410230e+01
1716.lowfreq: -0.0004 0.0007 0.0008 1.3594 6.0585 14.3485 39.6248 82.2015 143.9182
frequency: 39.3944 82.1969 143.9165 181.1102 208.8800 301.0911 314.6365 340.3276 393.7787 431.3138 450.2565 494.7984 515.3699 542.9451 572.6921 573.1054 602.1434 653.4536 721.3326 735.5415 752.4494 761.9434 773.0918 819.4521 854.8568 855.6592 866.2396 930.0350 933.9061 952.4905 971.6100 988.1145 1001.8603 1017.0920 1044.8812 1108.4171 1137.9311 1162.5469 1168.1071 1218.2728 1232.6930 1254.2764 1290.8061 1321.0709 1338.9957 1382.8056 1395.3709 1413.5788 1448.0199 1461.1199 1468.1440 1473.1610 1486.6742 1506.3991 1583.8219 1590.0460 1624.6359 1643.9921 2973.7892 3051.3035 3080.8264 3120.0727 3124.4298 3126.3141 3132.4389 3145.4203 3146.6484 3163.5630 3612.3383
redmass: 1.0420 4.0556 3.6642 3.9977 3.8969 4.5354 3.1704 4.1473 4.9411 2.8764 3.0507 1.1262 3.9351 6.3709 3.6351 6.2269 3.3632 6.5410 5.1318 2.4140 1.8177 5.8907 2.5692 1.4333 1.5156 5.1661 1.4420 2.6183 1.3968 1.3482 1.3065 5.8035 1.5878 2.0223 1.5418 1.8061 1.4162 1.7873 1.0995 1.8888 1.4460 2.5088 2.0384 2.6909 1.7572 3.9392 1.2538 3.4677 3.8834 3.2737 1.0461 1.1878 3.4688 2.9802 6.6490 6.4561 6.8133 7.7520 1.0370 1.0976 1.0987 1.0871 1.0850 1.0918 1.0891 1.0956 1.0965 1.1002 1.0801
irintensity: 0.5421 1.8538 0.2183 0.5751 0.1022 1.3381 0.2465 0.9710 0.4545 12.5896 0.5504 106.8033 5.9797 2.0220 3.3894 0.9482 2.6122 1.0158 1.5187 47.0764 52.8097 0.6883 28.0901 37.3700 0.9287 0.2503 11.9092 1.3414 2.9236 0.5979 0.0003 3.6644 11.4199 5.5349 13.4715 6.9041 10.1206 5.3790 2.5658 6.9797 22.9110 33.8956 2.5287 6.8147 72.0932 8.8956 7.1139 13.9863 23.0318 42.5412 12.8096 19.0783 25.2050 0.6762 2.1642 1.1775 57.9354 20.7774 50.7321 22.2588 21.0955 11.0193 0.2395 21.6711 3.4557 10.0840 44.6408 34.7406 45.5651
temp: 298.150 k
press: 1.00000 atm
elementType: 7 6 6 6 6 6 6 6 6 6 6 6 6 6 1 1 1 1 1 1 1 1 1 1 1
symmnumber: 1
zpe: 527612.9 jmol-1
zpe.correction: 0.200957 hartree
zpe.thermalcorrener: 0.211823 hartree
zpe.thermalcorrenthalpy: 0.212767 hartree
zpe.thermalcorrgfe: 0.164005 hartree
zpe.sumelectzpe: -555.810598 hartree
zpe.sumelectthermal: -555.799733 hartree
zpe.sumelectthermalent: -555.798789 hartree
zpe.sumelectthermalfe: -555.847550 hartree
dipole: 0.6934 -1.7071 0.0095
dipole: 1.8426
quadrupole: -72.4220 -66.9147 -88.8543
quadrupole: 0.5654 0.0173 -0.0122
quadrupole: 3.6416 9.1490 -12.7906 0.5654 0.0173 -0.0122
hfenergy: -556.0115554 hartree
pointgroup: C01 [X(C13H11N1)]
dipole: 0.2683733 0.6733101 0.0124638 debye
dipolederiv: -1.0526449 0.0180389 0.0011006 0.0264689 -0.4685134 -0.0047868 0.0014209 -0.0062177 -0.3231091 0.0574165 -0.1652284 -0.0041513 0.3364123 -0.1810772 -0.0040893 0.0082775 -0.0033475 -0.0320494 0.2262644 0.1450112 0.003362 -0.3762915 -0.1411231 -0.002672 -0.0098622 -0.0032365 -0.0146569 0.5031167 -0.3226208 -0.0086556 -0.7220204 0.2930456 0.0068461 -0.0172403 0.006515 0.0790367 0.4567562 0.3229342 0.007914 0.7737812 0.1894926 0.00248 0.018648 0.0030311 0.066115 -0.2335335 0.1589121 0.0041265 0.1150693 0.011755 0.0054365 0.0034373 0.0057918 -0.2295596 0.2426522 0.0282778 0.000304 -0.1339964 0.1099816 0.0057969 -0.002783 0.0058384 -0.1377761 0.3707678 0.0015757 -0.0019291 0.1759609 0.1479238 0.0036994 -0.005976 0.0029848 -0.0269594 0.1507054 -0.0590789 -0.0018632 0.0900557 0.0965619 0.006019 0.0019496 0.0062371 -0.1528954 -0.0303564 -0.1760672 -0.0047037 -0.0565185 0.040246 0.0063461 -0.0016696 0.0065316 -0.2102663 -0.3588846 -0.1127592 -0.0031868 -0.2842364 -0.0526058 0.0051153 -0.0069786 0.005057 -0.2157083 -0.1764863 0.1157645 0.002928 0.1830058 -0.0576992 0.0029858 0.0045435 0.0031356 -0.1920396 -0.0556747 0.0224508 0.0005725 -0.1442178 0.1202788 0.0074696 -0.0037412 0.0071314 -0.1713488 -0.1590563 -0.0284016 0.0002718 0.0659223 0.0892414 0.0008479 0.0147931 0.0014727 0.0696747 0.1179559 0.0002759 0.0003036 -0.0025987 0.1889088 -0.0034288 0.0002482 -0.0024836 0.3401777 0.0446867 -0.0517347 -0.0014694 -0.0852204 -0.0988491 -0.0065916 -0.0025016 -0.0070084 0.172508 0.064853 -0.0834054 -0.0020193 -0.0369434 -0.0836154 -0.0056025 -0.0010192 -0.0055146 0.1484809 0.0795163 0.0718484 0.0018508 0.0179278 -0.0906737 -0.0059917 0.0004788 -0.0061004 0.1520837 0.0658515 0.0175856 0.000556 0.0737463 -0.1143019 -0.0073315 0.0019398 -0.0072797 0.1775161 -0.0526874 0.1149115 0.0030366 0.1187666 -0.0228853 -0.0048018 0.0025436 -0.0045273 0.1578571 -0.0627972 -0.1072481 -0.0023711 -0.1261661 -0.019798 -0.0044531 -0.0028646 -0.0044621 0.1672783 -0.1429169 0.0599862 0.0018235 0.0601892 0.0735562 -0.0022387 0.0018525 -0.0022239 0.1617103 0.0538193 0.0105069 0.0005137 -0.1267225 -0.1476327 -0.0129183 -0.0077033 -0.0121296 0.1053638 -0.0531477 0.0129505 -0.0655578 0.0376163 0.0499943 0.0998426 -0.1386515 0.070815 -0.0358573 -0.056176 0.0055142 0.0672436 0.0200095 0.067789 -0.0879792 0.1408581 -0.0600103 -0.0555761 unknown
polarizability: 254.1183259|-1.1011859|144.8614381|-0.3440128|2.0289204|62.0912404 unknown
InChI: InChI=1S/C13H11N/c1-9-6-7-11-10-4-2-3-5-12(10)14-13(11)8-9/h2-8,14H,1H3
charge 0 multiplicity 1
25 atoms
N  -0.304576 1.655818 0.042798
C  0.344259 -0.55491 -0.013198
C  -1.114044 -0.50321 -0.009778
C  0.812668 0.802917 0.019723
C  -1.482326 0.888089 0.024989
C  2.186874 1.124489 0.026157
C  1.295781 -1.601865 -0.040243
C  3.128178 0.069182 -0.001472
C  -2.130863 -1.486542 -0.032731
C  -2.82963 1.305344 0.036745
C  2.668149 -1.284514 -0.034175
C  -3.481744 -1.077612 -0.021225
C  -3.824901 0.303373 0.013059
C  4.619941 0.359512 0.00149
H  -0.266979 2.67197 0.06523
H  2.528236 2.166037 0.051881
H  0.972466 -2.648562 -0.065381
H  -1.875856 -2.551913 -0.059307
H  -3.102547 2.366154 0.063367
H  3.410266 -2.091847 -0.054865
H  -4.278733 -1.828844 -0.038856
H  -4.881056 0.595656 0.021392
H  4.824213 1.442742 0.056848
H  5.120708 -0.122352 0.862399
H  5.105816 -0.028209 -0.914045
