program: Gaussian 09
title: 000218530
version: EM64L-G09RevD.01
frameworkgroup: C1[X(C9H19NO)]
method: RPBEPBE
basis: SDD
operation: Freq
keyword: #p
keyword: freq=noraman
keyword: PBEPBE/SDD
title: #p freq=noraman PBEPBE/SDD
converged: YES YES NO NO
title: Mulliken charges:
elementType: O N C C C C C C C C C H H H H H H H H H H H H H H H H H H H
charge: -0.266153 -0.294157 0.016599 -0.393202 -0.423311 -0.482428 -0.372111 -0.389785 -0.698160 -0.688607 -0.065391 0.226435 0.194507 0.190943 0.212413 0.190000 0.257889 0.222853 0.204408 0.203374 0.199167 0.215420 0.299521 0.216718 0.208832 0.212709 0.217555 0.204782 0.212840 0.166340
chargesum: 0.00000
title: Mulliken charges with hydrogens summed into heavy atoms:
elementType: O N C C C C C C C C C
charge: -0.266153 0.005363 0.243035 -0.007752 -0.020899 -0.001686 0.035671 0.024801 -0.059901 -0.053430 0.100950
polarizability: 1.20409168e+02 1.26436456e+00 1.15384226e+02 4.99397359e+00 1.69090343e+00 8.61152625e+01
1716.lowfreq: -13.7825 -0.0005 -0.0004 0.0006 3.8573 13.0432 25.6647 38.1905 57.3204
frequency: 24.9816 37.9411 57.2135 75.8322 87.0916 122.1092 137.8683 195.8443 211.6193 229.2140 238.1978 275.7343 304.4111 308.6437 371.9469 387.7230 533.3167 539.9251 571.6990 712.2034 735.4414 746.1342 808.6193 835.5497 874.8538 888.9037 914.5466 942.6524 962.0935 988.0425 1006.1031 1038.7089 1046.0457 1057.6378 1092.7745 1132.2159 1149.8960 1158.4041 1190.5261 1220.0158 1233.9373 1242.6589 1274.4649 1284.2639 1294.0688 1300.6668 1316.7933 1343.2400 1354.3557 1362.6025 1365.3152 1369.8149 1390.8975 1391.2416 1451.2161 1467.5818 1470.5665 1472.3449 1475.6889 1476.8120 1478.1087 1480.8005 1487.2605 1492.1034 1640.7416 2923.3081 2953.3663 2961.6327 2968.8060 2970.6140 2971.8959 2972.3807 2976.9579 2997.4421 3004.3538 3007.0019 3026.9469 3031.3826 3066.9642 3068.4673 3069.1026 3072.4458 3072.6109 3545.7311
redmass: 5.4530 4.3520 3.0153 1.6653 1.6020 3.0338 3.1478 2.4195 1.4686 1.1604 1.7076 2.8683 2.5610 2.5512 3.3509 2.7997 2.4263 2.1963 1.2316 2.3578 1.2106 1.1949 2.4873 1.4047 1.4639 1.7492 2.0691 2.1066 1.6201 1.8836 1.8099 2.9666 1.4673 2.2825 2.1552 2.0875 2.4344 2.1031 2.0560 1.4079 1.3685 1.2689 1.1992 1.1498 1.1179 1.2762 1.3086 1.4058 1.5709 1.3172 1.4428 1.2526 1.2140 1.2140 1.1471 1.1079 1.0993 1.1190 1.0485 1.0648 1.0665 1.3009 1.0863 1.0935 5.5368 1.0863 1.0601 1.0649 1.0608 1.0547 1.0420 1.0397 1.0759 1.0916 1.0683 1.0929 1.1019 1.1013 1.1006 1.1007 1.1015 1.0996 1.0996 1.0782
irintensity: 8.1716 4.7641 1.3779 0.0788 0.0022 3.9315 4.8319 0.1731 6.0366 0.1193 11.1727 12.2950 1.6513 4.2039 16.2223 9.0121 3.9168 4.8374 102.2958 1.2753 10.5205 5.7639 1.9800 3.3202 0.7819 4.2611 12.8846 5.8908 2.6517 1.2863 7.7773 0.6383 2.9859 0.6885 3.6877 4.0091 1.2766 8.6286 30.5062 7.9807 22.7487 0.3490 15.1474 0.3933 0.2333 3.6555 0.2374 2.5114 1.0338 15.5278 0.1263 9.3555 15.5561 6.5685 45.0102 13.0819 8.7129 15.8093 8.6230 35.6053 14.1516 41.9864 29.0622 12.4083 257.8739 125.7515 13.5107 3.8091 32.2465 66.0933 15.6881 28.9916 48.1731 7.3974 47.5706 15.0137 47.4729 38.9178 48.6379 59.7194 51.8207 45.7875 68.0318 11.2188
temp: 298.150 k
press: 1.00000 atm
elementType: 8 7 6 6 6 6 6 6 6 6 6 1 1 1 1 1 1 1 1 1 1 1 1 1 1 1 1 1 1 1
symmnumber: 1
zpe: 704550.5 jmol-1
zpe.correction: 0.268349 hartree
zpe.thermalcorrener: 0.282480 hartree
zpe.thermalcorrenthalpy: 0.283424 hartree
zpe.thermalcorrgfe: 0.225785 hartree
zpe.sumelectzpe: -483.418913 hartree
zpe.sumelectthermal: -483.404782 hartree
zpe.sumelectthermalent: -483.403838 hartree
zpe.sumelectthermalfe: -483.461476 hartree
dipole: 1.9068 3.7068 0.8806
dipole: 4.2605
quadrupole: -76.8955 -74.0537 -70.3352
quadrupole: -13.7529 -2.1505 -0.9383
quadrupole: -3.1341 -0.2922 3.4263 -13.7529 -2.1505 -0.9383
hfenergy: -483.6872617 hartree
pointgroup: C01 [X(C9H19N1O1)]
dipole: 0.7142246 -1.4835433 -0.3141819 debye
polarizability: 120.4974446|-1.4956422|115.5034118|-4.3138127|1.4153918|85.907801 unknown
InChI: InChI=1S/C9H19NO/c1-3-5-9(6-4-2)7-10-8-11/h8-10H,3-7H2,1-2H3
charge 0 multiplicity 1
30 atoms
O  -3.319585 1.714253 0.294362
N  -2.346983 -0.30394 -0.391802
C  0.066136 0.293215 0.150132
C  1.27482 1.060848 -0.45113
C  0.420068 -1.131651 0.661574
C  -1.09106 0.2871 -0.889467
C  2.462344 1.254478 0.519897
C  0.996764 -2.107724 -0.392484
C  3.569191 2.152796 -0.073641
C  1.292244 -3.501773 0.203581
C  -3.354765 0.457906 0.165826
H  -0.297292 0.874927 1.0234
H  0.924443 2.062025 -0.778558
H  1.63376 0.547027 -1.367585
H  1.146647 -1.042714 1.493697
H  -0.488559 -1.583644 1.111929
H  -1.322257 1.329355 -1.17276
H  -0.785348 -0.255137 -1.804509
H  2.896324 0.271134 0.7888
H  2.089838 1.700921 1.464527
H  0.290502 -2.217668 -1.240777
H  1.928964 -1.689781 -0.820721
H  -2.46666 -1.317841 -0.428094
H  4.411853 2.275894 0.631279
H  3.97215 1.721519 -1.009821
H  3.176934 3.159538 -0.311217
H  1.703185 -4.190461 -0.557334
H  0.374079 -3.961736 0.616333
H  2.027223 -3.431004 1.027397
H  -4.223959 -0.160661 0.490668
