program: Gaussian 09
title: 000218515
version: EM64L-G09RevD.01
frameworkgroup: C1[X(C9H20ClN2O5PS)]
method: RPBEPBE
basis: SDD
operation: Freq
keyword: #p
keyword: freq=noraman
keyword: PBEPBE/SDD
title: #p freq=noraman PBEPBE/SDD
converged: NO YES NO NO
title: Mulliken charges:
elementType: Cl S P O O O O O N N C C C C C C C C C H H H H H H H H H H H H H H H H H H H H
charge: -0.073448 1.044129 1.371916 -0.502841 -0.609841 -0.408291 -0.500879 -0.536770 -0.511273 -0.723837 -0.353447 -0.435418 -0.258348 -0.304005 -0.332336 -0.015117 -0.574971 -0.669500 -0.722125 0.227269 0.266563 0.225109 0.234893 0.225548 0.227781 0.249130 0.245083 0.333713 0.274541 0.241078 0.232901 0.252298 0.309377 0.227796 0.233201 0.247422 0.293130 0.281659 0.287913
chargesum: 0.00000
title: Mulliken charges with hydrogens summed into heavy atoms:
elementType: Cl S P O O O O O N N C C C C C C C C C
charge: -0.073448 1.044129 1.371916 -0.502841 -0.609841 -0.408291 -0.500879 -0.536770 -0.511273 -0.390125 0.140385 0.024584 0.194981 0.190208 0.183283 0.217784 -0.013297 0.038919 0.140577
polarizability: 2.04938392e+02 -6.79202096e+00 1.83372845e+02 -6.03974079e+00 5.73598042e+00 1.65579156e+02
1716.lowfreq: -1.5927 -0.0024 -0.0020 -0.0019 6.8188 8.7826 16.7480 18.1472 31.7654
frequency: 15.8410 18.0485 31.7497 34.0103 57.7007 60.2355 76.2899 92.6321 106.4167 110.8275 119.8327 143.7830 160.0848 177.8417 188.0609 200.9037 210.0469 230.4067 234.2258 252.3370 278.6879 282.8564 299.8565 310.8701 327.6399 341.5648 369.7848 387.9178 404.9698 416.3216 437.0890 454.0332 480.1751 525.4044 553.9092 571.5272 586.4306 608.2981 652.3392 688.7429 778.9345 783.9467 800.5992 829.7806 831.1600 878.0063 890.4115 896.1248 907.8983 915.2669 922.1881 992.6972 1006.2932 1027.2500 1033.1093 1033.7127 1046.5405 1056.1053 1067.2917 1090.9597 1101.4396 1124.7968 1137.9944 1150.1249 1203.3573 1215.3421 1235.0163 1246.5857 1251.9876 1268.2572 1274.7998 1304.2213 1316.1788 1323.4018 1340.9118 1347.7508 1350.4117 1355.0043 1360.5364 1389.9066 1410.4517 1415.3756 1417.8435 1452.2807 1455.2388 1461.6793 1465.7157 1471.2952 1475.0608 1476.9364 1481.7928 2982.5346 2982.8983 2991.4278 2993.2133 2998.5470 3006.0422 3013.2719 3041.7589 3051.4434 3053.7037 3057.6614 3070.1909 3079.5322 3084.2345 3096.8830 3110.9076 3146.7050 3190.3316 3200.0726 3552.0449
redmass: 5.3959 7.3276 7.2853 4.7986 4.1297 4.5897 5.2009 3.0706 3.7843 2.2145 6.7064 3.8591 1.1397 4.7390 3.7529 4.1211 5.3674 4.0283 2.9106 4.7565 2.2725 1.4446 3.2965 5.5966 7.0761 8.2479 3.2729 3.1860 5.3033 4.2603 3.9712 5.1375 3.0713 1.9153 3.4808 2.4629 4.6432 7.0960 7.6526 5.1280 1.2193 3.5473 3.0943 3.9602 3.0365 1.9754 2.8546 2.3627 3.0961 1.6188 2.2094 1.3171 1.8257 4.4351 3.1154 2.2503 2.0047 3.0393 1.9134 2.0825 4.2695 1.7283 1.7814 2.2942 1.4160 1.4255 1.5745 1.3917 1.1699 1.1528 1.3375 1.1931 1.1342 1.3687 1.3211 1.1994 1.2406 1.2485 1.2849 1.2177 1.2623 1.0526 1.0502 1.0842 1.0802 1.0547 1.0831 1.0829 1.0688 1.0832 1.0507 1.0648 1.0830 1.0671 1.0595 1.0363 1.0600 1.0598 1.0247 1.0960 1.0629 1.1022 1.1036 1.0986 1.1076 1.0988 1.1005 1.1124 1.1078 1.1077 1.0761
irintensity: 1.5997 0.7098 3.5147 1.1747 1.0613 0.9235 2.2773 1.1318 1.2579 1.9362 7.0675 12.6812 0.8239 0.6468 1.0422 2.9604 7.6708 1.3446 7.7437 0.5718 2.5498 1.9476 3.9238 23.6076 17.9851 8.1544 4.7501 2.4841 49.5037 17.6939 18.1105 43.0995 67.7630 44.5684 22.9752 15.6924 56.2075 61.0795 48.1816 158.4467 7.9470 36.2400 85.1060 11.1780 101.4717 2.1596 27.2388 84.3358 40.6085 65.3891 33.4222 29.1636 32.8942 68.4958 17.0401 86.6245 14.3113 22.1048 85.8013 2.7835 154.3702 30.7690 37.9617 15.8758 14.1740 23.2360 11.0922 4.0661 10.0413 11.3218 18.3363 16.5119 3.1703 6.1550 5.3536 0.2497 4.5957 20.9763 6.9355 23.6792 14.6748 12.0161 13.3292 14.4079 3.2629 8.5275 23.3403 10.0886 17.1938 4.1232 14.4191 21.0172 6.3787 41.4651 13.6605 5.0803 19.3317 72.7388 0.2523 27.5817 8.2761 16.0592 11.7361 6.3780 36.0478 19.9441 19.6958 7.9174 0.1975 0.0119 31.0014
temp: 298.150 k
press: 1.00000 atm
elementType: 17 16 15 8 8 8 8 8 7 7 6 6 6 6 6 6 6 6 6 1 1 1 1 1 1 1 1 1 1 1 1 1 1 1 1 1 1 1 1
symmnumber: 1
zpe: 797150.0 jmol-1
zpe.correction: 0.303618 hartree
zpe.thermalcorrener: 0.327355 hartree
zpe.thermalcorrenthalpy: 0.328300 hartree
zpe.thermalcorrgfe: 0.247297 hartree
zpe.sumelectzpe: -2038.183842 hartree
zpe.sumelectthermal: -2038.160105 hartree
zpe.sumelectthermalent: -2038.159161 hartree
zpe.sumelectthermalfe: -2038.240164 hartree
dipole: 5.5572 -3.3513 -1.7917
dipole: 6.7323
quadrupole: -131.5792 -149.1088 -131.4160
quadrupole: -2.6963 14.0268 10.8475
quadrupole: 5.7887 -11.7408 5.9520 -2.6963 14.0268 10.8475
hfenergy: -2038.4874609 hartree
pointgroup: C01 [X(C9H20Cl1N2O5P1S1)]
dipole: 2.168053 -1.5187731 -0.0913771 debye
polarizability: 204.8497087|-8.7635633|185.1657459|-1.6197891|-2.147685|163.8749381 unknown
InChI: InChI=1S/C9H20ClN2O5PS/c1-9(17-19(2,14)15)8-11-18(13)12(6-4-10)5-3-7-16-18/h9,11H,3-8H2,1-2H3
charge 0 multiplicity 1
39 atoms
Cl -4.2150 2.903073 -1.710163
S  3.509189 0.359877 -0.86009
P  -1.735248 -0.6587 1.095609
O  -1.230868 -2.318367 0.888749
O  -3.101018 -0.340371 1.85846
O  3.214124 0.737617 0.954009
O  3.727406 1.722038 -1.704663
O  2.453384 -0.749109 -1.407018
N  -1.630452 -0.14999 -0.568865
N  -0.377439 -0.005916 1.935953
C  -1.400596 -1.169513 -1.629287
C  -2.28356 -2.422719 -1.410157
C  -1.851924 -3.19489 -0.141698
C  -2.134287 1.190311 -0.929784
C  1.00363 -0.223218 1.480575
C  1.814956 1.093869 1.354183
C  -3.657484 1.179601 -1.153702
C  1.182431 2.157611 0.450027
C  5.187969 -0.450459 -0.508365
H  -1.650276 -0.697048 -2.596097
H  -0.328803 -1.447849 -1.665556
H  -2.211069 -3.098646 -2.283426
H  -3.337269 -2.097573 -1.324973
H  -1.047944 -3.916857 -0.365699
H  -2.70114 -3.732072 0.317976
H  -1.893763 1.903698 -0.12094
H  -1.611135 1.539187 -1.839076
H  -0.538474 0.216225 2.920974
H  0.972002 -0.70665 0.489522
H  1.54613 -0.910543 2.158791
H  2.006502 1.524986 2.358872
H  -3.961805 0.498374 -1.963073
H  -4.200892 0.961892 -0.222517
H  0.247664 2.515385 0.913612
H  0.930118 1.742027 -0.541877
H  1.865248 3.012509 0.314384
H  5.786794 0.311643 0.00645
H  5.599479 -0.72296 -1.489948
H  4.978722 -1.320871 0.125627
