program: Gaussian 09
title: 000218507
version: EM64L-G09RevD.01
frameworkgroup: C1[X(C19H21N3O)]
method: RPBEPBE
basis: SDD
operation: Freq
keyword: #p
keyword: freq=noraman
keyword: PBEPBE/SDD
title: #p freq=noraman PBEPBE/SDD
converged: YES YES NO NO
title: Mulliken charges:
elementType: O N N N C C C C C C C C C C C C C C C C C C C H H H H H H H H H H H H H H H H H H H H H
charge: -0.273506 -0.313905 -0.215149 -0.027546 0.223313 0.108020 -0.337554 -0.102783 -0.514398 0.208899 0.168628 -0.735434 0.117148 -0.582408 -0.637414 -0.341710 0.307876 -0.366358 -0.294278 -0.201897 -0.380025 -0.172110 -0.536862 0.242677 0.241299 0.213370 0.205400 0.257719 0.214213 0.202833 0.231163 0.244957 0.216559 0.248575 0.235983 0.234565 0.243483 0.288508 0.237982 0.239162 0.230592 0.215927 0.215262 0.239225
chargesum: 0.00000
title: Mulliken charges with hydrogens summed into heavy atoms:
elementType: O N N N C C C C C C C C C C C C C C C C C C C
charge: -0.273506 -0.056186 -0.215149 -0.027546 0.223313 0.108020 -0.094877 0.138516 -0.095629 0.208899 0.168628 -0.087226 0.117148 -0.337451 0.063702 -0.107144 0.307876 -0.122875 -0.005770 0.036085 -0.140863 0.058482 0.133553
polarizability: 3.15805456e+02 -5.38641989e+00 2.32888065e+02 2.09849578e+00 9.01672310e-01 1.49499976e+02
1716.lowfreq: -8.7438 -6.7411 -1.9423 -0.0007 -0.0004 0.0003 28.2422 33.7039 56.7480
frequency: 28.2392 33.6205 56.7421 75.3054 78.8784 83.0029 116.9660 123.0380 143.3493 169.5061 179.4578 206.1731 217.8594 229.7893 252.8743 253.9748 270.3030 297.2310 311.2108 328.4854 368.4278 389.7060 404.2766 430.6954 441.1246 452.0953 463.4767 486.7902 549.2736 575.8479 587.6865 610.8887 617.7138 622.6780 643.8831 665.8266 701.7202 714.7064 742.1882 746.6513 761.7410 780.9115 798.9756 810.7719 839.9755 851.5134 880.0577 905.4255 915.7575 924.2654 929.9923 963.8389 966.1426 970.7435 995.9827 1014.5566 1016.6729 1034.3306 1060.0065 1072.6344 1092.5646 1108.4143 1112.0975 1115.7325 1117.0810 1133.4108 1142.7303 1148.8357 1152.3929 1164.6371 1179.2811 1206.1343 1211.3552 1236.9090 1253.2114 1268.2080 1275.8056 1292.3688 1309.1157 1314.7301 1335.9366 1342.1319 1370.4807 1389.4676 1405.6378 1411.2121 1417.9322 1428.1405 1438.6979 1448.3323 1448.7469 1459.8913 1460.8197 1461.2607 1471.9452 1473.3289 1475.7336 1479.3622 1482.5693 1487.7028 1560.6715 1565.5544 1577.6477 1585.5116 1627.8242 2930.3841 2942.1366 2946.9237 2973.5709 2980.5823 2983.3669 3000.6785 3029.1055 3063.1273 3066.7299 3089.1933 3115.4345 3121.3187 3123.2388 3136.5793 3137.7679 3152.5998 3160.7891 3168.7754 3170.7557 3418.9264
redmass: 4.7366 4.5301 3.3857 3.4428 1.1756 2.9540 4.2952 4.3356 3.0222 2.5841 3.8683 2.1427 1.3799 1.9164 2.1044 3.0652 2.9341 2.9634 4.7748 3.8094 3.8598 6.2081 3.4114 2.9254 3.8902 3.3856 2.1011 5.0937 4.6712 4.2679 3.7377 4.0938 6.4097 3.6461 4.2824 5.0572 3.1582 4.7519 4.3366 3.7601 1.4679 4.5238 1.5266 2.3750 1.6608 3.9061 2.3712 1.5662 1.4302 1.5597 1.3271 2.6188 4.7850 1.9444 3.2967 1.7835 2.6575 2.1400 2.2936 1.8487 2.0262 1.9486 1.2625 1.4570 1.7555 1.3215 2.0867 1.4133 1.3293 2.3183 1.2559 2.7867 1.9094 1.8597 1.9982 1.4493 1.5461 1.5994 4.0679 2.6098 1.7281 1.2651 3.4272 1.2417 2.2536 2.7350 5.6554 1.3302 1.3683 1.5470 1.7535 1.1036 1.0619 1.0512 1.0662 1.2421 1.1539 2.3190 1.6545 1.5179 6.2060 7.3300 5.8728 7.7297 7.4297 1.0641 1.0819 1.0334 1.0407 1.0848 1.0364 1.0910 1.1033 1.1019 1.0972 1.0998 1.0985 1.0965 1.0884 1.0897 1.0886 1.0907 1.0943 1.0956 1.1001 1.0744
irintensity: 0.6921 0.7749 1.2088 1.7242 0.0432 1.6198 2.0180 3.2651 1.5419 4.6523 3.3892 2.0514 1.5144 2.6814 1.3739 1.8578 2.8180 1.3556 2.8742 4.4613 0.5035 0.1862 2.3833 6.4590 0.3457 1.2246 7.9145 12.8409 1.3927 3.7229 21.9546 7.0334 2.1926 21.1216 43.9291 13.2401 40.8126 28.1210 0.7470 0.8842 57.8621 2.4477 43.4460 11.7393 34.2810 0.7738 30.7779 5.0619 2.7104 1.8717 0.0169 4.4791 11.4585 3.8624 39.0482 11.9538 6.1176 11.0991 3.5472 20.6020 16.0490 14.6403 0.1739 11.3767 0.6475 10.5289 79.0174 6.9797 0.7660 84.3329 12.0494 46.5698 43.5693 11.0994 7.9138 14.3134 5.1594 0.6058 4.4271 0.9064 5.4565 5.2444 9.6678 20.7724 51.4656 44.6205 20.3626 20.0160 12.4972 39.6237 14.5037 1.9471 26.6153 12.1198 14.6910 52.3884 34.7371 61.3116 57.7598 8.8067 7.2602 0.5961 51.6434 20.7227 58.3416 49.4723 27.0425 71.6624 30.6454 19.1360 67.6581 33.2848 56.9838 32.2120 47.3907 30.4277 36.3871 15.5656 12.6058 13.6821 10.7060 11.1410 13.5275 11.3231 29.6544 2.1142
temp: 298.150 k
press: 1.00000 atm
elementType: 8 7 7 7 6 6 6 6 6 6 6 6 6 6 6 6 6 6 6 6 6 6 6 1 1 1 1 1 1 1 1 1 1 1 1 1 1 1 1 1 1 1 1 1
symmnumber: 1
zpe: 946960.9 jmol-1
zpe.correction: 0.360678 hartree
zpe.thermalcorrener: 0.381375 hartree
zpe.thermalcorrenthalpy: 0.382320 hartree
zpe.thermalcorrgfe: 0.311044 hartree
zpe.sumelectzpe: -974.425234 hartree
zpe.sumelectthermal: -974.404537 hartree
zpe.sumelectthermalent: -974.403593 hartree
zpe.sumelectthermalfe: -974.474868 hartree
dipole: -3.3584 1.4863 -0.2294
dipole: 3.6798
quadrupole: -129.7781 -121.4701 -131.5402
quadrupole: 10.1625 -1.5114 3.4674
quadrupole: -2.1820 6.1260 -3.9441 10.1625 -1.5114 3.4674
hfenergy: -974.7859122 hartree
pointgroup: C01 [X(C19H21N3O1)]
dipole: -1.3178361 0.5882894 -0.114634 debye
polarizability: 315.6780724|-5.6487166|232.9359104|4.4151755|-0.1043575|149.5795142 unknown
InChI: InChI=1S/C19H21N3O/c1-12-10-15-14-11-13(23-3)7-8-17(14)22(2)19(15)18(21-12)16-6-4-5-9-20-16/h4-9,11-12,18,21H,10H2,1-3H3
charge 0 multiplicity 1
44 atoms
O  5.485638 -0.047885 0.829535
N  -1.923471 1.710395 -1.28619
N  0.329819 -1.325264 -0.943024
N  -2.563277 -1.530366 0.4225
C  -0.327541 -0.096687 -0.75664
C  0.572156 0.849512 -0.249967
C  -1.760643 0.235236 -1.135972
C  -1.331289 2.502681 -0.163629
C  0.208289 2.295664 -0.021215
C  1.845098 0.184682 -0.091571
C  1.66148 -1.174832 -0.524318
C  -1.695211 3.985429 -0.344132
C  -2.819217 -0.315286 -0.152314
C  3.120394 0.612789 0.371574
C  -0.23934 -2.581488 -1.429597
C  2.718853 -2.111962 -0.49389
C  4.169711 -0.32868 0.394263
C  3.973146 -1.67792 -0.031831
C  -4.017006 0.400647 0.095268
C  -4.9733 -0.147273 0.976945
C  -3.498008 -2.049144 1.270162
C  -4.711383 -1.397146 1.584264
C  5.756165 1.312653 1.284124
H  -1.994199 -0.209982 -2.127973
H  -1.810603 2.123678 0.760976
H  0.524758 2.635822 0.986128
H  0.73786 2.949467 -0.749175
H  -1.541973 2.025223 -2.190724
H  -1.265249 4.595447 0.471066
H  -1.295136 4.375318 -1.300796
H  -2.790287 4.124002 -0.349512
H  3.266792 1.645936 0.700659
H  0.421745 -3.02229 -2.199094
H  -0.379031 -3.302091 -0.604297
H  -1.230024 -2.39855 -1.870196
H  2.579625 -3.150648 -0.811814
H  4.82739 -2.359909 0.016159
H  -4.15923 1.361072 -0.407994
H  -5.904879 0.389869 1.186777
H  -3.255258 -3.023651 1.710367
H  -5.422768 -1.857616 2.277144
H  5.129477 1.580782 2.158586
H  5.588147 2.051999 0.475101
H  6.81758 1.317766 1.574757
