program: Gaussian 09
title: 000218499
version: EM64L-G09RevD.01
frameworkgroup: C1[X(C18H19N3)]
method: RPBEPBE
basis: SDD
operation: Freq
keyword: #pfreq=noraman
keyword: PBEPBE/SDD
title: #p freq=noraman PBEPBE/SDD
converged: YES YES NO NO
title: Mulliken charges:
elementType: N N N C C C C C C C C C C C C C C C C C C H H H H H H H H H H H H H H H H H H H
charge: -0.302810 -0.233827 -0.024914 0.163644 -0.360960 0.141480 -0.105297 -0.509366 0.175057 0.182708 -0.736959 0.184505 -0.669597 -0.426671 -0.367843 -0.288665 -0.255431 -0.234028 -0.205526 -0.375422 -0.177519 0.256829 0.233035 0.211929 0.209454 0.255320 0.212016 0.199856 0.244055 0.235779 0.236626 0.265315 0.232573 0.234357 0.257275 0.217907 0.218390 0.237331 0.239196 0.230193
chargesum: 0.00000
title: Mulliken charges with hydrogens summed into heavy atoms:
elementType: N N N C C C C C C C C C C C C C C C C C C
charge: -0.047490 -0.233827 -0.024914 0.163644 -0.104130 0.141480 0.127738 -0.087982 0.175057 0.182708 -0.081032 0.184505 0.068124 -0.194098 -0.133485 -0.031390 -0.037524 -0.015638 0.031806 -0.136226 0.052675
polarizability: 2.78652396e+02 9.69490522e+00 2.05468410e+02 1.95941061e+01 5.63982231e+00 1.53036876e+02
1716.lowfreq: -9.5176 -6.7271 -0.0008 -0.0006 -0.0006 6.1322 33.7376 38.0451 44.1250
frequency: 33.6386 38.0262 44.1187 65.7346 78.0036 117.7308 142.6898 159.7618 172.7526 177.3290 225.3807 241.0075 262.4980 270.5065 305.0882 317.4431 325.8250 355.2951 403.9751 428.7388 436.1311 468.8850 530.0784 544.0079 547.7481 574.1174 579.5109 591.8850 615.2598 654.1446 658.9170 676.9989 747.3665 754.3305 758.3437 759.8574 779.5556 799.0118 822.1150 849.6296 859.1679 900.6284 908.9143 912.0858 929.2235 948.6494 962.1691 966.2463 968.3116 1003.3177 1010.4689 1019.3302 1037.7161 1061.9474 1077.8305 1084.1698 1105.9250 1116.1154 1119.5089 1130.2187 1148.3451 1159.0356 1162.8593 1183.5699 1192.7585 1210.3612 1235.5515 1242.7617 1269.3236 1298.7849 1303.7039 1323.6543 1326.5468 1334.4503 1345.5788 1371.0155 1387.0768 1408.9615 1411.5601 1415.0772 1437.5759 1444.0880 1454.3286 1458.5395 1471.7330 1472.4557 1473.5030 1477.4072 1478.7941 1496.4440 1563.7447 1575.6363 1578.6742 1581.3152 1624.5172 2940.7851 2972.3084 2974.4276 2981.2421 2998.1993 3003.0574 3048.1906 3065.4189 3094.2768 3111.2657 3120.5355 3124.6875 3129.5232 3134.3623 3142.8187 3150.8579 3159.8784 3168.2588 3445.7508
redmass: 3.5770 4.7703 2.5077 1.4657 3.5128 2.9493 2.8336 3.8607 3.9452 3.0360 1.1703 2.8421 3.3153 3.7948 4.1056 3.4842 4.3228 4.8795 3.4138 1.8515 2.6161 3.5510 2.5643 5.0859 3.8666 3.8484 4.5452 5.2482 6.4848 4.5933 4.5150 4.5347 1.3510 1.7373 4.1141 4.7858 3.2778 2.7295 3.3926 1.4861 2.6430 1.6348 1.3521 1.6563 1.3894 3.3978 1.4743 5.4140 1.3015 1.3333 2.0446 5.4240 2.4751 2.4749 1.9777 1.7731 1.8770 2.3607 1.3237 1.4779 2.1842 1.3775 1.0757 1.3201 1.9464 2.0553 2.0570 1.9340 1.4182 1.7309 2.1394 2.0347 1.5349 1.9961 1.3426 2.8928 1.2457 3.8959 3.4470 2.2858 1.3228 1.7171 1.7942 1.0990 1.4357 1.1680 1.3653 2.6884 1.0898 1.1694 5.8964 7.3041 5.7803 6.9811 7.4926 1.0632 1.0428 1.0365 1.0794 1.0838 1.0958 1.1018 1.0966 1.0997 1.0975 1.0845 1.0878 1.0887 1.0891 1.0951 1.0946 1.1001 1.1013 1.0750
irintensity: 1.1260 0.0894 0.8758 0.2272 0.9477 3.5340 2.3180 3.8073 6.6369 4.2281 0.3459 2.9821 5.4521 3.2112 0.2163 0.7916 1.4437 1.2975 4.6561 28.6849 4.8958 1.6331 59.3932 4.5158 14.4786 3.7542 5.3989 9.6234 5.0852 36.6996 12.9670 16.1193 97.9051 35.4897 1.9048 2.7595 3.4907 30.2296 0.7439 0.8403 21.6455 3.6513 0.6590 0.1847 2.9625 3.4084 0.8483 3.4353 0.0077 0.4396 13.9699 2.5546 6.7027 6.5568 18.0836 9.1423 9.0946 7.9686 1.3759 13.1792 26.4589 1.6537 0.0772 20.1313 7.6282 4.9282 13.3525 7.9342 3.3970 3.6062 0.1369 2.7294 6.1585 14.0627 1.6563 41.8080 16.6548 48.1939 6.1841 18.7455 11.3633 3.2713 32.6907 1.7588 5.3181 8.5116 27.2326 49.8636 5.7889 8.0970 13.3736 0.9883 32.8972 3.2957 2.1027 49.2693 31.6110 58.7635 25.1738 13.6063 29.0617 26.1191 45.4243 25.9155 6.4822 1.0453 17.6517 4.2325 6.2776 37.7922 23.0889 38.2148 26.5750 1.9894
temp: 298.150 k
press: 1.00000 atm
elementType: 7 7 7 6 6 6 6 6 6 6 6 6 6 6 6 6 6 6 6 6 6 1 1 1 1 1 1 1 1 1 1 1 1 1 1 1 1 1 1 1
symmnumber: 1
zpe: 864427.3 jmol-1
zpe.correction: 0.329243 hartree
zpe.thermalcorrener: 0.347420 hartree
zpe.thermalcorrenthalpy: 0.348364 hartree
zpe.thermalcorrgfe: 0.282388 hartree
zpe.sumelectzpe: -860.074484 hartree
zpe.sumelectthermal: -860.056306 hartree
zpe.sumelectthermalent: -860.055362 hartree
zpe.sumelectthermalfe: -860.121339 hartree
dipole: -0.8253 -1.0512 1.0014
dipole: 1.6700
quadrupole: -126.0920 -111.4238 -120.1511
quadrupole: 5.1667 -5.9778 0.9359
quadrupole: -6.8697 7.7985 -0.9288 5.1667 -5.9778 0.9359
hfenergy: -860.4037266 hartree
pointgroup: C01 [X(C18H19N3)]
dipole: 0.3503908 0.3760483 0.4092601 debye
polarizability: 272.6942051|15.0783314|207.239789|-30.132079|-1.3823912|157.2236877 unknown
InChI: InChI=1S/C18H19N3/c1-12-11-14-13-7-3-4-9-16(13)21(2)18(14)17(20-12)15-8-5-6-10-19-15/h3-10,12,17,20H,11H2,1-2H3
charge 0 multiplicity 1
40 atoms
N  1.461644 -1.62774 -1.429274
N  -1.006786 1.151038 -0.550522
N  3.187234 1.117255 -1.159237
C  -0.2841 -0.055691 -0.667256
C  1.104968 -0.188865 -1.25362
C  -1.040375 -1.113009 -0.157766
C  1.009678 -2.557188 -0.359207
C  -0.537801 -2.537118 -0.145835
C  -2.299693 -0.556449 0.292765
C  -2.247848 0.863089 0.036301
C  1.527704 -3.970352 -0.674907
C  2.194946 0.517391 -0.429092
C  -0.577842 2.481995 -0.984049
C  -3.466192 -1.105013 0.886866
C  -3.320134 1.725277 0.353488
C  2.192527 0.519646 0.988401
C  -4.538715 -0.248024 1.20703
C  -4.466628 1.151761 0.94323
C  3.27172 1.116597 1.675801
C  4.218616 1.698097 -0.481687
C  4.313499 1.713002 0.929057
H  1.158086 0.274747 -2.2582
H  1.483521 -2.211299 0.58143
H  -0.784151 -3.037836 0.812498
H  -1.02687 -3.135427 -0.944869
H  1.197092 -1.967731 -2.363448
H  1.218727 -4.686182 0.108368
H  1.120504 -4.33354 -1.639441
H  2.628832 -3.972391 -0.744457
H  -1.267421 2.890117 -1.746875
H  -0.542234 3.18413 -0.13009
H  0.430766 2.426238 -1.420921
H  -3.534501 -2.1797 1.091687
H  -3.272176 2.801286 0.152955
H  1.352478 0.07227 1.529734
H  -5.445273 -0.658918 1.665626
H  -5.3171 1.792264 1.203209
H  3.297148 1.122169 2.770997
H  4.990624 2.170305 -1.100848
H  5.16863 2.187598 1.420853
