program: Gaussian 09
title: 000218495
version: EM64L-G09RevD.01
frameworkgroup: C1[X(C18H19N3O)]
method: RPBEPBE
basis: SDD
operation: Freq
keyword: #p
keyword: freq=noraman
keyword: PBEPBE/SDD
title: #p freq=noraman PBEPBE/SDD
converged: YES YES NO NO
title: Mulliken charges:
elementType: O N N N C C C C C C C C C C C C C C C C C C H H H H H H H H H H H H H H H H H H H
charge: -0.271139 -0.294826 -0.473367 0.001924 -0.322833 -0.107219 0.141738 -0.519529 0.143657 0.183949 0.177372 0.417222 -0.731181 -0.579465 -0.340893 -0.329117 0.308809 -0.497620 -0.350413 -0.197439 -0.338407 -0.536804 0.228708 0.231634 0.214046 0.207572 0.257893 0.308863 0.243857 0.211320 0.201034 0.247090 0.233017 0.273720 0.256072 0.247364 0.232710 0.244476 0.216967 0.242053 0.217183
chargesum: 0.00000
title: Mulliken charges with hydrogens summed into heavy atoms:
elementType: O N N N C C C C C C C C C C C C C C C C C C
charge: -0.271139 -0.036933 -0.164504 0.001924 -0.094124 0.124416 0.141738 -0.097911 0.143657 0.183949 0.177372 0.417222 -0.074971 -0.332374 -0.107876 -0.055397 0.308809 -0.241548 -0.103049 0.035271 -0.093931 0.139399
polarizability: 3.10119721e+02 -6.79150921e+00 2.15339534e+02 -1.36832390e+01 -1.85934176e+00 1.41538638e+02
1716.lowfreq: -3.2483 -0.0005 -0.0002 0.0003 5.7699 8.7269 29.9291 34.0477 49.2642
frequency: 29.8031 34.0410 49.2173 74.4425 80.8745 119.9112 122.7946 169.2151 178.8673 203.1818 213.6422 228.7750 241.5265 258.9302 273.5226 314.3927 321.5023 348.2866 381.0049 396.0820 414.0187 428.1171 437.8162 466.5395 488.9375 508.5620 526.4689 572.4725 584.3779 596.9828 614.2025 627.8602 653.3068 676.1777 724.9369 729.6533 747.5762 752.1926 803.4412 810.2139 815.8945 817.2701 839.2504 844.8187 884.4435 908.9511 921.6293 931.2352 933.7975 950.3711 972.6578 992.3851 996.6873 1005.7073 1026.8487 1058.8669 1078.3095 1099.3591 1111.7334 1113.7583 1119.1079 1133.6005 1148.0558 1156.1425 1187.7715 1190.9269 1194.4268 1218.8049 1227.3842 1231.9654 1259.9054 1272.4606 1281.4200 1303.1615 1311.3006 1316.8902 1332.3725 1342.5234 1347.3736 1388.4330 1410.6060 1415.2191 1428.5568 1437.0032 1446.3446 1455.2451 1459.1367 1464.1540 1468.6284 1473.4374 1476.5507 1477.0276 1480.6670 1556.1669 1574.1694 1583.2507 1595.7563 1632.6012 2926.1310 2940.5092 2950.2263 2974.9639 2980.4486 3002.3208 3033.6427 3067.7462 3095.3525 3118.4657 3122.6146 3129.0719 3135.1054 3136.2049 3157.8499 3163.9266 3171.2262 3403.3284 3604.6416
redmass: 5.0739 4.9173 4.2332 3.7278 3.2530 3.9792 4.2528 2.7982 3.1858 3.4088 2.8438 1.2712 2.4453 1.4766 4.1798 3.8924 3.7348 4.3830 5.6170 3.1876 4.8996 2.8797 2.3366 3.0496 1.2633 4.6982 3.8422 3.7928 3.5062 5.6194 5.6551 2.9788 2.7876 4.1243 1.9366 5.2685 3.8515 5.1484 1.5180 4.2329 4.2617 1.6861 3.0222 1.7563 2.9861 1.6598 1.4701 1.4500 1.3310 1.5004 3.9939 1.3817 3.5473 3.5071 3.3262 3.9304 2.1393 2.5236 1.7938 1.2623 1.7569 1.8747 2.2288 1.4102 1.5575 1.4885 2.1418 1.5398 1.4288 2.0292 1.5391 1.4742 2.0070 2.0768 5.0942 2.0935 1.5344 1.4720 1.3623 1.2407 4.0004 2.2997 1.4737 1.1574 2.3685 2.1140 1.1185 1.0510 2.4269 1.0844 2.1253 1.0629 1.7776 5.5786 7.4994 5.8470 6.4658 7.2431 1.0821 1.0632 1.0334 1.0466 1.0751 1.0963 1.1034 1.0973 1.0997 1.0987 1.0907 1.0883 1.0895 1.0925 1.0907 1.0998 1.0952 1.0744 1.0803
irintensity: 0.3178 1.6593 0.6405 0.1522 3.9469 0.7600 2.7116 2.9403 2.4425 2.4459 3.9150 0.1892 3.2043 0.1344 3.0212 0.1820 1.1631 2.9120 1.5791 3.6196 2.3645 3.3925 2.5406 1.6544 85.5476 6.7095 3.0601 22.2051 6.7430 2.2860 11.6073 48.7213 56.8529 39.8715 40.6063 2.9320 2.6932 5.8978 47.8958 6.5854 4.7236 14.2607 19.6296 27.2443 3.4889 5.1049 0.4774 3.3033 0.0403 1.3954 6.1897 0.1194 49.9448 11.9712 1.0852 9.7071 15.6978 39.2607 6.1018 0.1724 16.6788 32.6237 19.1359 2.6638 2.7719 28.3757 159.0755 0.9437 31.9108 10.2759 3.8504 15.1129 27.7811 40.5342 4.8953 5.5032 21.5615 5.0071 1.3897 20.2428 33.0559 24.9951 26.7449 24.2027 35.7007 19.1325 1.4243 13.2345 88.3803 23.1178 42.6973 3.3901 22.4485 15.5529 2.4908 0.9438 32.2744 42.8300 30.8534 38.9329 68.7098 20.3198 25.7344 40.7809 54.7489 50.9608 25.4501 32.9451 18.2908 0.1465 10.7149 21.3683 9.9379 22.9644 8.5129 0.7509 51.4611
temp: 298.150 k
press: 1.00000 atm
elementType: 8 7 7 7 6 6 6 6 6 6 6 6 6 6 6 6 6 6 6 6 6 6 1 1 1 1 1 1 1 1 1 1 1 1 1 1 1 1 1 1 1
symmnumber: 1
zpe: 875787.1 jmol-1
zpe.correction: 0.333570 hartree
zpe.thermalcorrener: 0.352620 hartree
zpe.thermalcorrenthalpy: 0.353564 hartree
zpe.thermalcorrgfe: 0.285800 hartree
zpe.sumelectzpe: -935.205640 hartree
zpe.sumelectthermal: -935.186590 hartree
zpe.sumelectthermalent: -935.185646 hartree
zpe.sumelectthermalfe: -935.253410 hartree
dipole: -1.4979 0.7659 1.5319
dipole: 2.2752
quadrupole: -148.8192 -118.4909 -125.6862
quadrupole: -12.7620 2.1679 1.0106
quadrupole: -17.8205 12.5079 5.3126 -12.7620 2.1679 1.0106
hfenergy: -935.5392099 hartree
pointgroup: C01 [X(C18H19N3O1)]
dipole: -0.5861728 -0.3212673 -0.5953812 debye
polarizability: 309.9178844|5.8821741|214.7215109|15.7495532|-5.7665818|142.3584975 unknown
InChI: InChI=1S/C18H19N3O/c1-11-8-15-14-9-13(22-2)5-6-16(14)21-18(15)17(20-11)12-4-3-7-19-10-12/h3-7,9-11,17,20-21H,8H2,1-2H3
charge 0 multiplicity 1
41 atoms
O  -5.495447 0.706037 -0.505548
N  1.941366 -2.048404 0.201334
N  -0.065771 1.155269 0.760367
N  5.215952 0.993142 0.259508
C  1.791645 -0.662124 0.74949
C  0.778382 -2.94786 0.459657
C  -0.696511 -0.943264 0.109416
C  -0.551611 -2.419871 -0.17047
C  0.379694 -0.154908 0.522779
C  -1.863963 -0.085033 0.06867
C  -1.440356 1.226346 0.482397
C  2.881921 0.227209 0.15209
C  1.122145 -4.364039 -0.030422
C  -3.226771 -0.31003 -0.272984
C  -2.341874 2.311034 0.556021
C  2.685916 0.972244 -1.037427
C  -4.120074 0.778198 -0.195951
C  4.166322 0.272861 0.752023
C  -3.684083 2.076035 0.213617
C  3.760631 1.721073 -1.567152
C  5.000948 1.703474 -0.888806
C  -6.014005 -0.590782 -0.933728
H  1.976644 -0.729204 1.844662
H  0.642715 -2.968139 1.560398
H  -1.406884 -2.986387 0.250868
H  -0.547873 -2.626747 -1.262551
H  2.168488 -2.015233 -0.805201
H  0.524109 1.93324 1.048258
H  2.023742 -4.742902 0.479948
H  0.285557 -5.06038 0.161482
H  1.317912 -4.365998 -1.120747
H  -3.556686 -1.30456 -0.587234
H  -2.019209 3.309476 0.870913
H  1.707895 0.966169 -1.532408
H  4.364641 -0.298764 1.667139
H  -4.428078 2.877089 0.253139
H  3.644429 2.307433 -2.484194
H  5.858217 2.273295 -1.265176
H  -5.521003 -0.936809 -1.864247
H  -7.085798 -0.428075 -1.121833
H  -5.887178 -1.358708 -0.144492
