program: Gaussian 09
title: 000218493
version: EM64L-G09RevD.01
frameworkgroup: C1[X(C17H17N3)]
method: RPBEPBE
basis: SDD
operation: Freq
keyword: #pfreq=noraman
keyword: PBEPBE/SDD
title: #p freq=noraman PBEPBE/SDD
converged: YES YES NO NO
title: Mulliken charges:
elementType: N N N C C C C C C C C C C C C C C C C C H H H H H H H H H H H H H H H H H
charge: -0.294056 -0.481436 -0.000692 -0.320284 -0.106975 0.140827 -0.520213 0.143436 0.164053 0.190799 0.451087 -0.730313 -0.423031 -0.369198 -0.339334 -0.349420 -0.254384 -0.221573 -0.345930 -0.349199 0.233668 0.231192 0.216651 0.210725 0.257925 0.311183 0.242278 0.212572 0.202384 0.232757 0.231387 0.243671 0.265274 0.219701 0.220981 0.241508 0.241980
chargesum: 0.00000
title: Mulliken charges with hydrogens summed into heavy atoms:
elementType: N N N C C C C C C C C C C C C C C C C C
charge: -0.036131 -0.170253 -0.000692 -0.086617 0.124217 0.140827 -0.092837 0.143436 0.164053 0.190799 0.451087 -0.073078 -0.190274 -0.137811 -0.095663 -0.084145 -0.034684 -0.000592 -0.104421 -0.107219
polarizability: 2.72161527e+02 3.27181313e+00 2.04234544e+02 -1.98712968e+01 -1.43222943e+00 1.28675398e+02
1716.lowfreq: -8.4692 -0.8678 -0.0003 0.0002 0.0005 8.3891 34.4990 44.3957 52.6045
frequency: 34.4574 44.3454 52.5948 74.9517 130.2198 160.6061 175.0228 187.7463 225.7177 239.9130 262.2300 285.5554 314.7763 322.1035 367.2154 370.0588 426.1812 442.2431 459.4346 503.3326 509.7106 558.1419 573.5346 578.1213 596.9051 605.8637 640.0275 661.6772 677.0740 747.7070 752.1707 753.9546 757.5622 772.3607 817.0921 823.3625 839.9951 851.6922 871.8360 891.4620 905.6639 928.6386 931.3100 957.6563 961.1639 970.3828 970.7376 978.8660 1010.8626 1055.0030 1063.1687 1079.6364 1082.7593 1102.8935 1114.6390 1142.5390 1147.2935 1167.6750 1189.2163 1201.2744 1218.3518 1228.9921 1231.3066 1257.1285 1270.7724 1277.6610 1300.8613 1314.2015 1324.4761 1338.0240 1345.2057 1354.3798 1388.3440 1401.7416 1408.6259 1433.2980 1438.1942 1459.1589 1464.0566 1466.4394 1473.5485 1476.7805 1481.1700 1555.3713 1576.7043 1585.1750 1591.3223 1631.1294 2928.3607 2945.2271 2975.4451 2980.9781 3006.7826 3068.4428 3094.8172 3122.2631 3128.3219 3129.5487 3130.8269 3143.5132 3151.9209 3157.5808 3161.6748 3401.4128 3601.5150
redmass: 4.0135 4.7734 4.3928 3.8929 3.4972 4.0452 3.2442 3.2992 1.1663 3.8371 5.1652 4.9683 3.7157 3.7418 4.6920 2.4897 2.9816 2.1247 4.4086 1.3229 2.9725 3.6397 4.9020 3.3746 4.3252 5.4236 3.3997 5.7441 2.5804 1.9054 2.3326 3.4050 4.2890 4.4840 3.2333 1.5284 2.8519 1.4959 3.5893 1.2485 1.5892 1.5653 1.3893 3.6483 4.4662 1.4904 1.3250 1.4769 2.0247 4.0398 2.2197 1.8939 1.8369 2.3139 2.1088 2.2785 2.2516 1.1480 1.3011 1.9238 1.3217 1.4575 1.9525 1.6793 1.4313 1.9532 2.8764 3.4413 1.4921 1.3115 1.3274 2.0628 1.2405 2.0958 4.2366 2.9710 1.1423 1.1328 2.1505 3.6665 1.0735 1.0748 2.9624 7.0386 7.1181 5.6328 6.5644 7.1027 1.0821 1.0637 1.0468 1.0740 1.0970 1.0974 1.0997 1.0848 1.0874 1.0891 1.0889 1.0951 1.0958 1.0988 1.1001 1.0743 1.0803
irintensity: 0.2279 0.1901 0.4816 0.1706 0.5766 0.2817 3.3768 4.0081 0.7779 0.7524 0.3225 2.3049 0.6839 1.4717 1.4917 0.6432 9.3975 6.4323 1.2745 77.7721 11.9662 10.1859 6.1873 2.5023 18.7599 4.8709 31.1407 12.2478 103.9698 60.2382 27.0245 27.3416 2.3738 3.4966 10.2198 16.5175 19.2513 0.3466 2.3999 0.1810 1.9738 2.3068 3.0123 2.4098 2.4574 0.4018 0.0869 0.1262 9.7468 12.6383 9.0228 7.8528 2.2397 3.9053 15.3564 18.0715 15.8266 0.9913 17.0778 1.8231 3.6579 19.8303 11.3905 9.3146 10.4263 5.2463 39.8602 21.8217 3.5863 34.4824 1.6193 22.4830 19.0210 34.2817 7.5702 8.6128 27.8338 2.2605 3.5981 34.6927 17.3504 3.5648 1.1025 7.3252 0.5047 46.2385 1.6414 2.0454 31.6805 40.8895 19.5282 29.6928 36.2075 49.8240 25.1321 1.5050 12.0798 2.9740 12.9828 35.1112 30.6662 4.2155 35.5144 0.6525 47.8172
temp: 298.150 k
press: 1.00000 atm
elementType: 7 7 7 6 6 6 6 6 6 6 6 6 6 6 6 6 6 6 6 6 1 1 1 1 1 1 1 1 1 1 1 1 1 1 1 1 1
symmnumber: 1
zpe: 793969.8 jmol-1
zpe.correction: 0.302407 hartree
zpe.thermalcorrener: 0.318681 hartree
zpe.thermalcorrenthalpy: 0.319626 hartree
zpe.thermalcorrgfe: 0.258131 hartree
zpe.sumelectzpe: -820.856110 hartree
zpe.sumelectthermal: -820.839836 hartree
zpe.sumelectthermalent: -820.838892 hartree
zpe.sumelectthermalfe: -820.900386 hartree
dipole: -1.1517 1.0058 -0.9112
dipole: 1.7801
quadrupole: -130.8519 -112.4110 -115.5627
quadrupole: 5.8237 -7.3023 4.5533
quadrupole: -11.2434 7.1975 4.0459 5.8237 -7.3023 4.5533
hfenergy: -821.1585171 hartree
pointgroup: C01 [X(C17H17N3)]
dipole: -0.475447 0.3590397 -0.3680996 debye
polarizability: 270.7492657|4.1510211|204.0184412|-23.734884|-6.6083904|130.3037621 unknown
InChI: InChI=1S/C17H17N3/c1-11-10-14-13-4-2-3-5-15(13)20-17(14)16(19-11)12-6-8-18-9-7-12/h2-9,11,16,19-20H,10H2,1H3
charge 0 multiplicity 1
37 atoms
N  1.329158 2.020977 -0.231892
N  -0.726152 -1.181635 -0.629005
N  4.496248 -1.796294 0.672551
C  1.131332 0.635081 -0.766538
C  0.151055 2.922875 -0.405359
C  -1.295834 0.92236 0.062484
C  -1.127678 2.399671 0.325683
C  -0.256614 0.128983 -0.422792
C  -2.462521 0.069207 0.187707
C  -2.075181 -1.248894 -0.253109
C  2.278331 -0.248977 -0.271217
C  0.534076 4.339943 0.051543
C  -3.797725 0.284229 0.620141
C  -2.975422 -2.335803 -0.262483
C  3.531045 -0.216082 -0.931134
C  2.16339 -1.070349 0.877354
C  -4.701337 -0.796784 0.610327
C  -4.294464 -2.092715 0.174956
C  4.597535 -0.996068 -0.432689
C  3.28614 -1.815864 1.306941
H  1.219028 0.70608 -1.873363
H  -0.06662 2.938977 -1.492976
H  -2.012241 2.965539 -0.029807
H  -1.040703 2.60859 1.413612
H  1.621317 1.984109 0.757826
H  -0.159564 -1.963742 -0.95119
H  1.395069 4.714829 -0.527395
H  -0.31318 5.037432 -0.079484
H  0.812028 4.346414 1.123744
H  -4.121106 1.275246 0.958674
H  -2.670034 -3.333492 -0.597671
H  3.674211 0.416447 -1.813802
H  1.21932 -1.129164 1.429492
H  -5.734603 -0.645255 0.942006
H  -5.020458 -2.913471 0.179181
H  5.575923 -0.990051 -0.926257
H  3.22503 -2.458047 2.193143
