program: Gaussian 09
title: 000218488
version: EM64L-G09RevD.01
frameworkgroup: C1[X(C19H26N2O4)]
method: RPBEPBE
basis: SDD
operation: Freq
keyword: #p
keyword: freq=noraman
keyword: PBEPBE/SDD
title: #p freq=noraman PBEPBE/SDD
converged: YES YES NO NO
title: Mulliken charges:
elementType: O O O O N N C C C C C C C C C C C C C C C C C C C H H H H H H H H H H H H H H H H H H H H H H H H H H
charge: -0.285560 -0.306028 -0.272621 -0.276682 -0.139534 -0.063128 -0.374990 -0.378847 -0.366065 -0.369542 0.142720 0.035807 -0.613414 0.217425 0.183414 0.119489 0.063215 -0.806300 -0.450489 0.258868 -0.341387 -0.230074 -0.241458 -0.675773 -0.686852 0.260307 0.221869 0.217448 0.268170 0.213898 0.194862 0.200933 0.214215 0.188515 0.223195 0.223055 0.230292 0.293758 0.221610 0.243465 0.242767 0.199550 0.241024 0.207579 0.213583 0.205102 0.230630 0.228394 0.210877 0.235496 0.227213
chargesum: 0.00000
title: Mulliken charges with hydrogens summed into heavy atoms:
elementType: O O O O N N C C C C C C C C C C C C C C C C C C C
charge: -0.285560 -0.306028 -0.272621 -0.276682 -0.139534 -0.063128 0.107185 0.106771 0.042694 0.045605 0.142720 0.035807 0.021350 0.217425 0.183414 0.119489 0.063215 -0.060640 -0.207024 0.258868 -0.098620 0.210500 0.179705 -0.011646 -0.013266
polarizability: 3.55384030e+02 1.80395561e+00 2.73722726e+02 3.19049883e+00 -5.53246450e+00 1.44806741e+02
1716.lowfreq: -6.2327 -4.8693 -0.0008 -0.0006 -0.0005 3.0602 16.1885 17.4128 31.9346
frequency: 15.6178 16.7835 31.8962 47.2441 58.5911 61.5368 65.1839 75.9902 88.0489 102.6415 109.4541 131.3909 143.7898 158.5603 164.2912 192.5554 223.9201 225.0942 236.7503 239.9321 243.8207 275.3669 286.0276 289.4333 294.8068 313.7783 320.3449 333.4938 346.6954 374.6601 383.7327 396.7643 415.4900 454.8930 474.2130 519.3835 542.9970 561.0602 582.7920 600.6686 626.9441 640.8754 672.0957 675.8061 704.7008 726.4438 743.8506 753.1105 765.3174 790.3047 813.8775 817.7010 831.4393 840.2057 858.8055 875.9757 923.7262 934.9606 976.6595 996.2337 1002.1193 1017.1010 1027.9683 1046.1047 1047.4332 1052.1958 1056.4939 1065.3336 1073.0189 1106.1134 1113.7316 1116.0076 1130.5938 1132.0079 1134.8749 1145.9019 1157.2264 1158.6740 1186.2499 1194.1789 1206.9278 1231.5624 1239.8899 1250.0122 1261.9591 1270.8033 1285.0906 1291.1563 1332.4430 1347.6951 1348.6046 1357.6964 1365.0943 1366.4707 1369.4585 1391.0018 1395.2273 1395.9301 1401.6255 1410.1161 1424.2645 1429.7190 1453.3102 1455.3483 1457.4311 1458.7412 1459.8408 1460.9184 1464.7958 1473.4201 1475.0500 1480.5892 1480.6926 1482.5252 1484.6789 1493.3327 1496.3723 1529.1911 1586.7326 1594.8789 1624.2254 2848.8448 2852.9227 2868.8132 2959.0208 2975.6910 2976.9337 2980.9513 2984.2902 2993.2883 2996.7998 3017.6034 3018.6805 3028.8432 3033.3236 3046.9785 3062.2162 3075.6554 3090.5669 3094.0238 3096.7053 3103.8184 3106.1039 3120.2807 3139.2990 3148.7180 3170.7530
redmass: 3.9192 3.7147 3.8867 2.4065 4.5933 2.5082 3.3513 1.3330 2.3676 1.8771 3.3934 4.2020 3.0946 3.8452 3.9490 3.1436 1.9396 1.5462 2.3967 1.2311 1.5238 3.4550 4.8850 4.3729 3.8690 2.5094 2.4021 4.7054 3.4789 3.7762 5.4471 4.1435 2.1774 5.5983 2.7056 4.9111 4.5677 4.9139 4.8264 4.8481 4.1168 3.9006 3.8907 5.4029 5.0945 8.7347 3.4722 7.1676 5.9039 1.4795 1.1380 3.4654 1.1095 1.5867 3.8953 3.3889 1.3260 2.1147 3.0287 2.8633 2.4586 2.3074 2.9947 1.5915 1.6630 3.6227 3.1275 1.7139 1.9044 1.8593 2.1899 2.2302 1.9953 1.4008 1.4312 2.6190 2.9323 2.0847 2.5900 1.1092 2.7513 3.0805 2.5112 1.2525 1.1465 2.2155 1.5661 1.5604 1.2822 1.3732 1.6239 1.5013 1.7006 1.3607 1.8512 1.7891 1.3046 1.4428 1.7271 3.5425 2.8963 1.2228 1.1577 1.0801 1.0957 1.0463 1.0667 1.0404 1.1124 1.1062 1.2764 1.0648 1.0576 1.0605 1.3455 1.1327 1.5338 5.7084 7.9458 8.1246 8.8346 1.0662 1.0655 1.0647 1.0553 1.0396 1.0696 1.0614 1.0671 1.0369 1.0362 1.0728 1.1076 1.0883 1.0906 1.0971 1.1010 1.1009 1.0984 1.0990 1.0951 1.1020 1.1014 1.0969 1.0920 1.0875 1.0958
irintensity: 1.5711 0.0897 0.3379 0.2451 1.1966 6.2841 0.2325 2.5243 4.5631 1.9017 0.3667 0.4785 1.0347 1.9350 3.2070 3.1092 0.1684 0.5384 0.6204 0.3761 1.3826 0.9868 3.5946 2.0193 3.3611 14.6212 4.8031 4.1727 8.5450 2.1427 1.7916 1.7645 0.2171 12.5718 0.6364 4.3607 4.8529 2.8055 6.4429 7.3218 5.7966 3.7671 12.7877 5.9852 5.6902 6.1514 8.8238 6.0294 5.3402 48.5529 5.3916 8.6657 0.0277 1.1196 1.5762 12.3315 0.8112 1.1955 34.4943 40.2289 100.3547 45.6504 101.1867 11.2794 19.6314 140.9679 133.7806 12.1918 10.3384 58.4836 3.4896 21.9579 10.7696 7.0370 4.9345 26.6889 19.3311 28.5302 32.5361 6.8525 53.1254 31.4718 260.5256 47.7714 1.1980 103.7670 46.6013 95.0325 1.7402 4.6300 37.5443 2.4160 6.1775 2.5462 40.8412 39.0225 60.1903 48.5819 69.8051 4.8392 124.2647 18.1503 45.3013 4.0026 6.7189 7.1428 29.1262 13.2634 40.3218 8.7837 66.0060 1.9321 7.3262 19.0342 62.3411 8.8231 31.4859 189.2696 9.1335 113.8539 57.0264 44.4680 71.8162 176.9061 51.6980 38.1670 35.0355 41.3715 68.4696 25.5037 26.0407 51.8546 32.1512 56.3773 58.2859 19.6526 8.3225 33.5736 34.5967 32.9691 7.8817 38.5843 34.7602 1.1521 3.4902 5.6861 18.3548
temp: 298.150 k
press: 1.00000 atm
elementType: 8 8 8 8 7 7 6 6 6 6 6 6 6 6 6 6 6 6 6 6 6 6 6 6 6 1 1 1 1 1 1 1 1 1 1 1 1 1 1 1 1 1 1 1 1 1 1 1 1 1 1
symmnumber: 1
zpe: 1105995.5 jmol-1
zpe.correction: 0.421251 hartree
zpe.thermalcorrener: 0.447229 hartree
zpe.thermalcorrenthalpy: 0.448173 hartree
zpe.thermalcorrgfe: 0.362913 hartree
zpe.sumelectzpe: -1148.087854 hartree
zpe.sumelectthermal: -1148.061876 hartree
zpe.sumelectthermalent: -1148.060932 hartree
zpe.sumelectthermalfe: -1148.146191 hartree
dipole: 4.3960 -2.4159 -0.2468
dipole: 5.0222
quadrupole: -118.6955 -144.2648 -151.2725
quadrupole: 13.2494 -1.6286 6.8363
quadrupole: 19.3821 -6.1872 -13.1949 13.2494 -1.6286 6.8363
hfenergy: -1148.509105 hartree
pointgroup: C01 [X(C19H26N2O4)]
dipole: 1.6656388 1.0411702 0.2138855 debye
polarizability: 354.9015302|2.8893907|273.901535|10.0148278|-3.7107858|145.1104309 unknown
InChI: InChI=1S/C19H26N2O4/c1-5-23-15-8-7-14-13(3)16(25-17(14)18(15)24-6-2)19(22)21-11-9-20(4)10-12-21/h7-8H,5-6,9-12H2,1-4H3
charge 0 multiplicity 1
51 atoms
O  -0.428017 -0.242189 0.188696
O  -3.027121 -2.758302 0.625744
O  1.540363 1.884066 0.15221
O  4.265785 1.104405 0.366925
N  -3.302245 -0.6588 -0.346397
N  -4.952959 1.699663 -0.407406
C  -4.772356 -0.774072 -0.220325
C  -2.888125 0.525275 -1.133729
C  -5.345361 0.516194 0.396008
C  -3.477043 1.806004 -0.511145
C  -2.507615 -1.682637 0.157269
C  -1.028086 -1.553192 0.169343
C  -5.575347 2.944157 0.081582
C  -0.052516 -2.542789 0.245643
C  1.231366 -1.854811 0.296361
C  0.954994 -0.459711 0.262291
C  1.934797 0.548563 0.290879
C  -0.240445 -4.034241 0.264715
C  2.578696 -2.27865 0.377722
C  3.287509 0.093554 0.364679
C  3.591655 -1.300711 0.415483
C  1.986069 2.847469 1.203108
C  5.685334 0.696022 0.343475
C  1.304274 4.173447 0.879585
C  6.51188 1.978542 0.301806
H  -4.994364 -1.654339 0.403307
H  -5.214018 -0.927594 -1.225291
H  -3.290231 0.414045 -2.161493
H  -1.79482 0.599298 -1.176548
H  -6.449488 0.449978 0.412112
H  -4.990902 0.598469 1.455985
H  -2.997668 1.974883 0.486921
H  -3.229065 2.668277 -1.157997
H  -5.265811 3.217252 1.122583
H  -6.675341 2.839561 0.069292
H  -5.304553 3.782281 -0.585588
H  0.158263 -4.462797 1.204203
H  -1.307286 -4.293103 0.202087
H  0.307715 -4.509475 -0.571117
H  2.836161 -3.341612 0.41307
H  4.635068 -1.622616 0.475344
H  1.672428 2.457921 2.192458
H  3.086731 2.925732 1.174891
H  5.914226 0.100642 1.251052
H  5.870151 0.06757 -0.551276
H  1.590755 4.939463 1.623625
H  1.606114 4.528388 -0.120851
H  0.206269 4.062047 0.89281
H  7.588984 1.732513 0.275206
H  6.265818 2.571469 -0.595368
H  6.318176 2.598288 1.194062
