program: Gaussian 09
title: 000218485
version: EM64L-G09RevD.01
frameworkgroup: C1[X(C18H23NO5)]
method: RPBEPBE
basis: SDD
operation: Freq
keyword: #p
keyword: freq=noraman
keyword: PBEPBE/SDD
title: #p freq=noraman PBEPBE/SDD
converged: YES YES NO NO
title: Mulliken charges:
elementType: O O O O O N C C C C C C C C C C C C C C C C C C H H H H H H H H H H H H H H H H H H H H H H H
charge: -0.246342 -0.290662 -0.273174 -0.306365 -0.277096 -0.158008 -0.363358 -0.371717 0.038565 -0.298982 -0.300019 0.154457 0.217701 0.184845 0.122057 0.063800 -0.450139 -0.806183 0.260543 -0.341183 -0.229048 -0.242102 -0.675109 -0.686806 0.225158 0.266487 0.278967 0.220383 0.199082 0.220332 0.219192 0.203711 0.244169 0.222799 0.295240 0.231044 0.243741 0.242279 0.199505 0.213785 0.208575 0.206333 0.227837 0.230822 0.211597 0.227613 0.235674
chargesum: 0.00000
title: Mulliken charges with hydrogens summed into heavy atoms:
elementType: O O O O O N C C C C C C C C C C C C C C C C C C
charge: -0.246342 -0.290662 -0.273174 -0.306365 -0.277096 -0.158008 0.128287 0.127633 0.038565 0.120432 0.122883 0.154457 0.217701 0.184845 0.122057 0.063800 -0.205970 -0.057100 0.260543 -0.097442 0.212736 0.180259 -0.010117 -0.011921
polarizability: 3.41336526e+02 -2.71822601e+00 2.53826235e+02 -2.90437556e+00 -5.92762275e+00 1.32841568e+02
1716.lowfreq: -6.4546 -0.0004 -0.0004 0.0007 2.8221 7.0069 17.5331 25.1965 37.7382
frequency: 16.9320 25.1577 37.7024 49.6218 61.8056 67.1577 70.0002 83.8282 98.6157 108.6354 113.5644 134.3719 151.9008 164.4276 197.2504 228.1072 237.1699 239.6259 245.4280 271.5819 281.6525 288.6508 291.6800 297.4046 329.8355 341.3858 375.1432 382.2078 396.1326 413.1197 452.7465 458.5246 519.6439 541.6531 559.5974 580.1941 596.8303 625.3272 638.6934 669.1525 675.4568 703.4345 725.3718 752.7368 765.7088 789.8481 791.6072 812.8559 816.7289 833.3549 835.7273 858.2259 872.2924 916.8655 923.8440 977.2440 995.3954 1001.5627 1015.3581 1027.5047 1045.8430 1048.3021 1052.3247 1057.5171 1071.8310 1090.6236 1113.1736 1116.0197 1121.2883 1132.1441 1135.4715 1154.6113 1174.1192 1186.8982 1191.6937 1205.6173 1239.3974 1248.9386 1257.8300 1265.2784 1267.8915 1278.6637 1327.4465 1339.3107 1347.8522 1354.3725 1361.5119 1367.6272 1368.0199 1391.8946 1395.7083 1398.1543 1402.9740 1410.1862 1421.0952 1446.2786 1453.2160 1454.2256 1454.7217 1458.1968 1462.3217 1463.0648 1475.9193 1480.6190 1484.2220 1485.1282 1494.1403 1497.2965 1526.9452 1586.8967 1593.5022 1624.4844 2953.7220 2958.9664 2960.1437 2976.0095 2976.2722 2982.0356 2982.8133 2993.3945 2997.4993 3019.7322 3047.2612 3064.6181 3082.8809 3086.9534 3087.4161 3090.6113 3094.4396 3104.1022 3106.6055 3123.0279 3129.0987 3149.3356 3171.3698
redmass: 4.4810 4.2275 4.2488 2.4072 2.6042 4.0837 3.9464 3.0671 1.2370 3.2838 1.8125 4.0874 3.3901 5.5456 3.3326 2.6558 1.8080 1.9977 1.2771 3.4094 3.9189 4.4475 3.9147 3.7000 3.9369 4.8306 3.9354 6.4309 4.8350 2.0244 4.7014 3.2517 4.9276 3.9896 4.9058 4.7131 4.7693 3.9491 3.9323 3.9666 5.4181 5.1599 8.7792 7.2027 6.0294 1.4876 4.4077 1.1037 3.8494 1.6869 1.1059 3.8794 3.3859 2.5331 1.3263 3.0570 2.8786 2.4150 2.3143 3.0111 1.5335 2.4309 3.5611 2.9263 3.4638 2.4722 2.2476 2.1832 2.3658 1.4009 1.4291 1.9989 3.4109 2.5651 1.0721 2.9897 2.2503 1.2485 1.4490 1.1441 1.6872 1.6628 1.2588 1.2358 1.5772 1.3868 1.6225 1.8761 1.3791 1.8444 1.5378 1.3535 1.5294 3.3280 3.2125 1.0839 1.1191 1.1494 1.1087 1.0416 1.0399 1.1224 1.3138 1.0629 1.1220 1.2819 1.1424 1.4565 5.7860 7.8425 8.2291 8.8877 1.0678 1.0682 1.0555 1.0539 1.0534 1.0617 1.0658 1.0371 1.0363 1.1076 1.0971 1.1006 1.0955 1.0967 1.0983 1.0983 1.0989 1.1020 1.1014 1.0968 1.0925 1.0874 1.0957
irintensity: 1.0392 0.0239 0.3401 0.3843 5.6073 1.8887 0.3480 7.6309 0.7674 1.9737 0.5587 0.7039 0.7716 1.4620 3.9165 0.3976 2.8752 1.3401 1.3424 0.6205 6.7282 2.6631 9.0787 1.3236 4.7513 13.0441 2.6162 1.9982 0.6200 0.8756 8.3624 6.1376 5.5240 14.6948 2.9965 12.3181 8.0760 4.9018 3.7265 10.3898 7.4670 6.2573 6.2851 5.7831 6.8292 48.4259 23.4865 3.9605 10.8666 0.7696 0.1130 2.2562 1.8530 3.5841 0.9252 33.9938 93.1915 39.1563 37.0901 103.6895 7.6831 99.9708 121.9185 115.9882 26.2971 42.1655 5.7599 27.4663 13.3969 5.9900 4.8685 44.8262 0.2771 26.2376 3.3399 71.3350 285.0948 47.2530 50.7110 0.5323 47.6156 138.0105 0.9318 6.9344 35.7261 8.0737 4.8493 37.9729 12.3922 60.4914 15.5766 91.5138 73.4684 8.4807 105.7738 4.9562 14.0840 55.3979 11.6269 9.6302 13.1086 24.9819 71.8625 2.6027 22.1488 61.0283 9.5648 27.2820 174.8784 15.9501 111.5322 61.4941 53.9108 29.9018 50.1902 53.3349 32.4383 40.5926 91.6439 25.2287 25.4023 31.6461 18.8375 7.5640 48.1664 23.6967 19.8700 35.4788 32.0006 39.6595 34.3013 1.1621 6.3901 5.3277 17.4316
temp: 298.150 k
press: 1.00000 atm
elementType: 8 8 8 8 8 7 6 6 6 6 6 6 6 6 6 6 6 6 6 6 6 6 6 6 1 1 1 1 1 1 1 1 1 1 1 1 1 1 1 1 1 1 1 1 1 1 1
symmnumber: 1
zpe: 1002797.8 jmol-1
zpe.correction: 0.381946 hartree
zpe.thermalcorrener: 0.406206 hartree
zpe.thermalcorrenthalpy: 0.407151 hartree
zpe.thermalcorrgfe: 0.326068 hartree
zpe.sumelectzpe: -1128.739811 hartree
zpe.sumelectthermal: -1128.715550 hartree
zpe.sumelectthermalent: -1128.714606 hartree
zpe.sumelectthermalfe: -1128.795689 hartree
dipole: -5.7528 -0.1854 -0.1101
dipole: 5.7568
quadrupole: -121.7851 -141.3915 -141.9342
quadrupole: -4.1648 3.1465 5.4834
quadrupole: 13.2518 -6.3545 -6.8973 -4.1648 3.1465 5.4834
hfenergy: -1129.1217564 hartree
pointgroup: C01 [X(C18H23N1O5)]
dipole: 2.2485689 0.1848324 -0.199012 debye
polarizability: 340.7098983|2.1771829|253.3120656|-12.1925783|9.4571613|133.9823658 unknown
InChI: InChI=1S/C18H23NO5/c1-4-22-14-7-6-13-12(3)15(24-16(13)17(14)23-5-2)18(20)19-8-10-21-11-9-19/h6-7H,4-5,8-11H2,1-3H3
charge 0 multiplicity 1
47 atoms
O  -4.958468 2.398856 0.462983
O  -0.645788 -0.026061 -0.133721
O  1.540196 1.867056 -0.064314
O  -3.517807 -2.239494 -0.559805
O  4.166083 0.79733 -0.334075
N  -3.541862 -0.115604 0.392603
C  -5.020682 -0.08633 0.301885
C  -2.996257 1.031285 1.15768
C  -1.387795 -1.262291 -0.150357
C  -5.468817 1.253379 -0.312079
C  -3.486977 2.350786 0.52917
C  -2.870139 -1.227093 -0.111186
C  -0.528529 -2.350611 -0.276876
C  0.822499 -1.806764 -0.325747
C  0.703655 -0.392166 -0.238403
C  1.788179 0.502931 -0.249224
C  2.113173 -2.374176 -0.445437
C  -0.879988 -3.810685 -0.3450
C  3.081124 -0.096615 -0.358021
C  3.22741 -1.513279 -0.465015
C  2.109762 2.81865 -1.065749
C  5.531799 0.232675 -0.342229
C  1.525161 4.187409 -0.730897
C  6.496746 1.410679 -0.239094
H  -5.451569 -0.193383 1.317954
H  -5.345262 -0.943941 -0.309941
H  -1.899084 1.007815 1.169736
H  -3.375547 0.965154 2.198459
H  -5.112881 1.320567 -1.36294
H  -6.56686 1.349244 -0.288089
H  -3.193408 3.21291 1.150219
H  -3.056372 2.460691 -0.489208
H  2.250539 -3.456964 -0.522834
H  -0.373044 -4.373904 0.461634
H  -1.967508 -3.952558 -0.268785
H  -0.546102 -4.244144 -1.307235
H  4.228135 -1.944797 -0.554313
H  3.210549 2.803052 -0.989245
H  1.810276 2.483565 -2.079103
H  5.646441 -0.458261 0.517579
H  5.691199 -0.336286 -1.280991
H  1.91209 4.947491 -1.434459
H  0.423805 4.171577 -0.800575
H  1.804981 4.486808 0.293834
H  7.539214 1.043874 -0.228406
H  6.377331 2.093189 -1.098037
H  6.316898 1.980937 0.687953
