program: Gaussian 09
title: 000218483
version: EM64L-G09RevD.01
frameworkgroup: C1[X(C17H22N2O4)]
method: RPBEPBE
basis: SDD
operation: Freq
keyword: #p
keyword: freq=noraman
keyword: PBEPBE/SDD
title: #p freq=noraman PBEPBE/SDD
converged: YES YES NO NO
title: Mulliken charges:
elementType: O O O O N N C C C C C C C C C C C C C C C C C H H H H H H H H H H H H H H H H H H H H H H
charge: -0.314378 -0.295921 -0.298970 -0.275553 -0.140010 -0.061253 -0.376064 -0.382327 -0.375546 -0.362292 0.143197 0.044967 -0.613016 0.204393 0.207769 0.137599 -0.806161 0.089699 -0.425932 0.196468 -0.339221 -0.527154 -0.499962 0.224536 0.256426 0.256583 0.215747 0.203915 0.216266 0.217704 0.188301 0.223810 0.224852 0.190444 0.290359 0.224800 0.232749 0.247650 0.252748 0.264324 0.232116 0.216601 0.252208 0.228969 0.208558
chargesum: 0.00000
title: Mulliken charges with hydrogens summed into heavy atoms:
elementType: O O O O N N C C C C C C C C C C C C C C C C C
charge: -0.314378 -0.295921 -0.298970 -0.275553 -0.140010 -0.061253 0.104898 0.090003 0.044635 0.043713 0.143197 0.044967 0.026090 0.204393 0.207769 0.137599 -0.058252 0.089699 -0.178281 0.196468 -0.086473 0.185887 0.189773
polarizability: 3.22971529e+02 4.24338896e+00 2.29710873e+02 2.22836310e+01 -9.50736490e+00 1.42759100e+02
1716.lowfreq: -17.6534 0.0005 0.0006 0.0007 2.7373 6.1703 17.7882 27.2512 37.8130
frequency: 11.2143 26.9932 37.5330 48.5367 63.2379 70.2074 86.8605 101.1937 108.5601 134.3673 154.4881 161.7363 164.1337 193.3893 205.2949 224.0739 230.4145 233.3025 257.9957 273.4801 286.0251 311.3292 316.5970 331.8674 352.1828 366.7732 376.0914 402.1261 429.1295 461.3271 470.2526 475.2930 527.2587 548.3450 571.8604 578.8083 622.8782 629.3241 639.2433 667.0747 693.4290 722.9076 745.8954 747.0726 768.3373 813.4199 836.3370 859.2395 908.4593 914.2354 935.1041 945.2029 989.1182 998.5863 1012.8143 1024.4087 1046.6482 1047.9633 1051.5109 1064.4202 1070.1565 1104.3098 1109.1925 1114.6862 1125.4643 1142.7614 1149.1278 1151.1481 1156.6914 1162.2266 1184.6416 1195.5641 1198.8594 1230.9294 1244.9469 1273.9133 1288.3344 1293.6959 1338.4963 1346.8199 1353.5969 1363.2312 1369.7866 1386.2113 1398.5406 1404.4917 1419.7181 1432.2212 1433.2141 1440.7783 1445.0112 1453.2494 1455.9002 1456.2798 1457.5142 1461.4546 1462.5811 1470.2802 1474.2454 1479.3167 1481.7562 1482.5756 1488.0587 1532.2089 1585.3414 1594.4616 1614.7276 2840.8719 2856.4452 2870.6717 2975.4946 2978.4201 2980.6905 2990.6235 2993.8440 3020.0308 3029.6121 3035.3104 3050.4385 3077.8907 3081.9457 3090.7773 3099.1512 3121.4543 3126.7187 3126.7753 3127.2155 3152.0528 3175.0244
redmass: 3.5123 3.8675 3.0016 4.4793 3.2180 2.7275 3.4744 3.3876 1.1138 3.3922 1.7291 2.4826 2.4568 1.4439 2.5457 3.2330 1.9474 1.8911 3.6725 3.5793 4.9803 2.4490 2.6655 3.5037 3.3668 5.1384 4.8221 2.7502 3.4396 4.2747 5.2129 3.2875 6.1430 4.8720 5.4440 3.6314 4.4927 3.3071 4.8386 5.6280 4.8964 9.4330 5.2117 4.1230 6.7648 1.4691 1.6120 3.9812 6.0284 6.0114 2.2106 1.3147 4.7173 2.5128 2.5482 4.8249 1.5112 1.6824 2.8306 1.7241 2.1218 1.7425 1.2414 1.2476 1.7186 2.4863 1.8257 1.5832 1.5057 2.5279 3.1043 1.1129 2.2353 2.9232 3.0018 2.4492 1.4871 1.5923 1.2479 1.3536 2.1787 1.6726 1.5623 3.6577 1.3589 3.3803 2.3820 1.1755 1.4400 1.2430 1.1795 1.0720 1.1006 1.0957 1.0556 1.0901 1.0877 1.0553 1.1008 1.0702 1.0528 1.0681 3.3531 5.9721 8.8228 7.8468 8.0924 1.0703 1.0642 1.0623 1.0338 1.0391 1.0340 1.0679 1.0670 1.0734 1.0881 1.0902 1.0972 1.1010 1.0993 1.0975 1.0971 1.0971 1.1046 1.0937 1.1049 1.0880 1.0969
irintensity: 1.2831 1.0060 1.8080 1.4058 0.4045 6.5194 8.4289 0.4999 0.0661 2.7051 1.9656 0.4850 1.3382 4.2730 3.4830 4.2878 2.5213 1.2812 2.6013 2.0066 3.7167 13.9308 1.1516 3.8277 4.5893 1.5615 8.4445 2.7612 4.1197 0.6659 28.3583 1.2592 3.0945 3.6555 3.0420 1.1021 16.2666 6.6509 0.8379 8.5497 2.8694 7.5589 1.7703 8.4676 2.8635 48.8623 0.0548 7.2278 25.1715 3.5528 5.6092 0.2481 88.5701 102.9897 42.3451 116.2303 1.3525 6.6855 44.3266 14.9220 7.5631 42.6232 4.2435 7.3017 5.9747 56.7920 18.3087 3.8281 14.1888 5.3316 26.1453 6.1214 27.0722 38.1396 225.3416 80.8452 23.8948 113.5343 1.1272 3.3670 49.1951 43.0552 28.2809 23.3228 76.4375 5.2429 159.9134 4.3806 12.4416 4.3046 56.9908 18.1890 17.9722 24.2960 1.8203 29.5924 2.9855 36.3085 16.1229 25.5063 8.2313 18.6340 103.5213 197.7463 12.1640 169.0277 37.3832 56.3782 45.4141 190.6752 57.0217 32.4857 88.2781 8.4051 67.8539 49.1972 47.1359 63.7255 17.2189 32.1721 27.0033 45.0703 5.6166 1.3733 19.9940 5.5038 18.5986 3.0285 10.2571
temp: 298.150 k
press: 1.00000 atm
elementType: 8 8 8 8 7 7 6 6 6 6 6 6 6 6 6 6 6 6 6 6 6 6 6 1 1 1 1 1 1 1 1 1 1 1 1 1 1 1 1 1 1 1 1 1 1
symmnumber: 1
zpe: 959142.4 jmol-1
zpe.correction: 0.365318 hartree
zpe.thermalcorrener: 0.388598 hartree
zpe.thermalcorrenthalpy: 0.389542 hartree
zpe.thermalcorrgfe: 0.310769 hartree
zpe.sumelectzpe: -1069.627239 hartree
zpe.sumelectthermal: -1069.603959 hartree
zpe.sumelectthermalent: -1069.603015 hartree
zpe.sumelectthermalfe: -1069.681788 hartree
dipole: 0.1953 -2.7658 -0.1145
dipole: 2.7751
quadrupole: -124.5145 -131.9086 -135.9736
quadrupole: -3.2801 -12.3136 -9.8216
quadrupole: 6.2844 -1.1097 -5.1747 -3.2801 -12.3136 -9.8216
hfenergy: -1069.9925569 hartree
pointgroup: C01 [X(C17H22N2O4)]
dipole: 0.1272219 1.0818571 0.0736249 debye
polarizability: 320.7113412|-7.8341134|230.7006057|-28.8030361|-5.6010822|144.0295542 unknown
InChI: InChI=1S/C17H22N2O4/c1-11-12-5-6-13(21-3)16(22-4)15(12)23-14(11)17(20)19-9-7-18(2)8-10-19/h5-6H,7-10H2,1-4H3
charge 0 multiplicity 1
45 atoms
O  -0.309594 0.244001 -0.203754
O  2.178323 -2.236295 -1.129681
O  -2.458268 2.332371 0.129768
O  -5.045534 1.241813 1.063475
N  2.599158 -0.007829 -0.577637
N  4.877106 1.274028 0.641512
C  3.935033 -0.080003 -1.211746
C  2.416716 1.195195 0.264456
C  5.049243 0.033731 -0.154176
C  3.553942 1.290475 1.305744
C  1.769541 -1.124423 -0.639502
C  0.369837 -1.030155 -0.155806
C  5.988429 1.500793 1.58489
C  -0.497506 -2.028944 0.272476
C  -1.778679 -1.387678 0.533671
C  -1.627731 -0.011232 0.219896
C  -0.202059 -3.491903 0.452775
C  -2.651203 0.95486 0.343955
C  -3.02816 -1.844386 1.027147
C  -3.90467 0.467723 0.823448
C  -4.066263 -0.911958 1.164126
C  -1.788837 2.71983 -1.13255
C  -5.279701 2.493878 0.320784
H  4.027581 0.759944 -1.927493
H  4.005044 -1.039095 -1.748733
H  1.441666 1.163918 0.768672
H  2.448627 2.09432 -0.38187
H  5.032454 -0.880588 0.492415
H  6.030521 0.071599 -0.662811
H  3.446984 2.2393 1.864393
H  3.44609 0.448056 2.038464
H  5.847153 2.467562 2.100818
H  6.942262 1.546497 1.02933
H  6.080531 0.702624 2.364419
H  0.831806 -3.7201 0.155774
H  -0.362566 -3.799175 1.503806
H  -0.87893 -4.102975 -0.17395
H  -3.184932 -2.894794 1.289613
H  -5.053713 -1.209145 1.529669
H  -0.759643 2.326131 -1.172572
H  -1.778437 3.820199 -1.123464
H  -2.363578 2.351759 -2.004279
H  -4.589671 3.286433 0.648491
H  -6.322859 2.757228 0.555637
H  -5.168314 2.333811 -0.768501
