program: Gaussian 09
title: 000218480
version: EM64L-G09RevD.01
frameworkgroup: C1[X(C16H21NO4)]
method: RPBEPBE
basis: SDD
operation: Freq
keyword: #p
keyword: freq=noraman
keyword: PBEPBE/SDD
title: #p freq=noraman PBEPBE/SDD
converged: YES YES NO NO
title: Mulliken charges:
elementType: O O O O N C C C C C C C C C C C C C C C C H H H H H H H H H H H H H H H H H H H H H
charge: -0.307268 -0.301853 -0.284512 -0.294776 -0.134880 0.206987 0.208048 0.040371 0.148537 0.147782 -0.333667 -0.351692 0.082471 -0.427087 -0.803127 0.194176 -0.343807 -0.671738 -0.656947 -0.523185 -0.523110 0.254539 0.201706 0.250651 0.212726 0.247609 0.288250 0.223457 0.234103 0.252708 0.260117 0.216630 0.204010 0.238277 0.216441 0.209578 0.251160 0.231746 0.228570 0.264206 0.213733 0.229060
chargesum: 0.00000
title: Mulliken charges with hydrogens summed into heavy atoms:
elementType: O O O O N C C C C C C C C C C C C C C C C
charge: -0.307268 -0.301853 -0.284512 -0.294776 -0.134880 0.206987 0.208048 0.040371 0.148537 0.147782 0.122578 0.111685 0.082471 -0.179478 -0.057317 0.194176 -0.091099 0.009019 0.007349 0.188291 0.183889
polarizability: 2.96918460e+02 -2.85512508e+00 2.19353728e+02 8.96882839e+00 -4.54645554e-01 1.20183655e+02
1716.lowfreq: -11.9215 -0.0006 -0.0006 -0.0002 1.0737 3.1027 20.1936 41.1783 50.2194
frequency: 20.0142 41.1066 50.2171 66.5473 72.5182 86.8421 93.3962 101.0150 110.6907 115.3955 125.2487 150.2921 157.3807 165.8489 189.4866 194.6089 204.6053 225.8133 250.6366 257.6466 263.7881 284.1886 316.9982 325.9397 337.7915 372.8328 403.0445 414.8635 459.3066 471.7263 498.8647 532.4725 557.7991 582.6772 602.5293 623.7692 656.1732 664.7827 688.2630 727.2985 752.6609 766.3068 774.7272 782.8857 818.1678 851.4537 903.9089 913.4092 940.9619 946.3116 985.1412 1001.1056 1017.1597 1045.2037 1049.2517 1066.2462 1074.6492 1080.8605 1099.9558 1110.6173 1114.0360 1125.8931 1151.3081 1156.4532 1171.4437 1183.3559 1204.4606 1215.5935 1242.3260 1281.6881 1304.5624 1344.7218 1352.4136 1362.4513 1380.9802 1382.3483 1382.9364 1396.3879 1400.8346 1417.9906 1427.1446 1439.0094 1449.6172 1455.3766 1455.8683 1459.0820 1465.1874 1467.5235 1469.5560 1477.5825 1481.7753 1483.1996 1484.4422 1485.3592 1488.2965 1535.2754 1585.3155 1595.5219 1610.9152 2975.3215 2977.8228 2980.4250 2983.1802 2985.7579 2989.4381 3011.4510 3049.6284 3069.3600 3074.5540 3083.7959 3084.5984 3085.8192 3096.2881 3106.3689 3109.6032 3121.1135 3127.0444 3128.6843 3151.1511 3173.7949
redmass: 3.5656 4.0746 3.4257 2.8148 2.8418 2.1051 2.3528 1.4986 2.4389 2.6677 4.2484 2.1913 1.3048 1.4626 1.5465 1.5256 1.5122 2.9268 3.7319 3.4697 4.8461 5.0583 3.1944 3.6476 4.7631 3.9705 3.2320 5.5321 4.7309 5.0025 3.4466 6.1729 4.7842 5.4485 5.2356 4.5795 4.4713 5.7121 4.7843 8.7877 6.9199 4.5542 1.2318 1.3195 1.4918 2.5621 7.1929 5.2663 2.0914 1.3245 5.2449 2.6117 4.9230 1.5855 2.5472 2.5726 2.2164 1.8384 1.7770 1.2379 1.2408 1.8443 1.3525 1.4320 2.0465 3.8979 2.8946 2.2518 2.9409 1.7504 1.4042 1.2443 1.9122 1.8433 1.2406 1.2953 3.2558 1.4716 2.8766 2.3429 1.4697 1.2580 1.2342 1.0813 1.0783 1.0515 1.0508 1.0500 1.0712 1.1092 1.2354 2.1471 1.0545 1.0991 1.0700 4.1259 8.6351 7.9002 8.1361 1.0343 1.0392 1.0675 1.0308 1.0367 1.0376 1.0619 1.0972 1.0997 1.0978 1.0997 1.1014 1.0994 1.0935 1.1015 1.1000 1.0970 1.1034 1.1048 1.0880 1.0970
irintensity: 0.9721 0.4900 4.9868 3.2063 5.4765 2.7605 0.5912 0.2669 2.7399 2.6360 3.0645 1.3534 1.9827 1.7823 1.9096 2.1744 1.8756 4.0607 5.0747 1.3524 0.8562 1.8861 1.2519 1.2925 6.1938 3.2995 12.8221 5.4418 7.6842 21.2645 5.5311 0.9563 0.7919 5.9986 2.3242 11.7795 5.5221 6.4214 1.9608 7.5370 0.9641 0.3643 3.0450 21.1370 44.0169 40.5871 27.0450 16.3319 5.8378 0.9339 80.5476 13.2847 121.2238 6.9021 50.9669 71.8773 5.0112 35.0821 22.2865 17.0415 3.9318 10.4345 1.2044 17.0399 5.9346 47.9404 4.2902 14.2362 155.6991 122.3325 46.3664 3.0758 26.7826 46.7397 16.6786 38.1798 30.6230 54.8288 20.3675 135.8156 13.6577 8.7945 63.2987 21.5061 12.2466 7.9372 3.6197 13.9749 21.5752 24.9816 16.4084 104.3720 15.5142 5.3096 16.6724 168.3050 9.1792 129.9683 23.1038 99.8500 29.8608 33.0628 52.7309 44.9877 29.5976 45.0550 17.2801 16.1894 17.6518 19.5796 43.1907 34.1692 24.5886 13.1134 48.3300 1.5330 19.0771 19.3537 3.3263 10.3213
temp: 298.150 k
press: 1.00000 atm
elementType: 8 8 8 8 7 6 6 6 6 6 6 6 6 6 6 6 6 6 6 6 6 1 1 1 1 1 1 1 1 1 1 1 1 1 1 1 1 1 1 1 1 1
symmnumber: 1
zpe: 895397.9 jmol-1
zpe.correction: 0.341039 hartree
zpe.thermalcorrener: 0.363898 hartree
zpe.thermalcorrenthalpy: 0.364842 hartree
zpe.thermalcorrgfe: 0.288207 hartree
zpe.sumelectzpe: -976.329729 hartree
zpe.sumelectthermal: -976.306870 hartree
zpe.sumelectthermalent: -976.305925 hartree
zpe.sumelectthermalfe: -976.382561 hartree
dipole: 0.0036 -2.8828 -1.7903
dipole: 3.3935
quadrupole: -124.9720 -113.7314 -124.6416
quadrupole: -7.6475 -1.7916 -4.4071
quadrupole: -3.8570 7.3836 -3.5266 -7.6475 -1.7916 -4.4071
hfenergy: -976.6707677 hartree
pointgroup: C01 [X(C16H21N1O4)]
dipole: -0.0104135 0.9908637 -0.8947649 debye
polarizability: 296.3086765|-5.7606044|216.4963191|-12.564971|-16.6911877|123.6508483 unknown
InChI: InChI=1S/C16H21NO4/c1-6-17(7-2)16(18)13-10(3)11-8-9-12(19-4)15(20-5)14(11)21-13/h8-9H,6-7H2,1-5H3
charge 0 multiplicity 1
42 atoms
O  -0.25478 0.355898 -0.10337
O  2.364706 1.849022 -0.427884
O  4.714487 0.160848 -0.478136
O  -3.330187 -1.273338 0.952885
N  -3.212366 0.640603 -0.365297
C  0.917888 -1.642424 -0.005363
C  -0.497463 -1.948799 0.154711
C  -1.179164 -0.739643 0.080318
C  1.024141 -0.232689 -0.151783
C  -2.630028 -0.46453 0.244388
C  -4.654657 0.868753 -0.091735
C  -2.595909 1.485775 -1.41568
C  2.249183 0.452394 -0.301484
C  2.094585 -2.432867 -0.04269
C  -1.071073 -3.324551 0.350213
C  3.415749 -0.364904 -0.370944
C  3.324731 -1.7823 -0.23773
C  -5.574965 0.050227 -1.023361
C  -2.225562 2.900453 -0.924234
C  1.720398 2.64327 0.642896
C  4.980207 1.111903 -1.580907
H  -4.847908 0.583445 0.955908
H  -4.850402 1.951232 -0.202198
H  -1.698461 0.982018 -1.805285
H  -3.320514 1.55783 -2.251739
H  2.04938 -3.520286 0.069172
H  -2.165761 -3.282443 0.445232
H  -0.795686 -3.988473 -0.491235
H  -0.669438 -3.782439 1.274149
H  4.264282 -2.341305 -0.282378
H  -5.410987 -1.027648 -0.859467
H  -6.635172 0.277989 -0.808399
H  -5.38623 0.281714 -2.087967
H  -1.472065 2.83872 -0.122064
H  -1.803276 3.493013 -1.756646
H  -3.107254 3.441191 -0.53491
H  0.630588 2.471942 0.660411
H  1.937672 3.692565 0.392594
H  2.159178 2.387721 1.625231
H  4.338282 2.003306 -1.497004
H  4.816904 0.615525 -2.557091
H  6.041646 1.381382 -1.47143
