program: Gaussian 09
title: 000218477
version: EM64L-G09RevD.01
frameworkgroup: C1[X(C16H21NO5)]
method: RPBEPBE
basis: SDD
operation: Freq
keyword: #p
keyword: freq=noraman
keyword: PBEPBE/SDD
title: #p freq=noraman PBEPBE/SDD
converged: YES YES NO NO
title: Mulliken charges:
elementType: O O O O O N C C C C C C C C C C C C C C C C H H H H H H H H H H H H H H H H H H H H H
charge: -0.234514 -0.292614 -0.279335 -0.280273 -0.230281 -0.097640 0.207741 0.205525 0.214307 0.041362 -0.554022 -0.486078 0.232944 -0.354496 0.226175 -0.812073 -0.286631 0.164281 -0.614966 -0.616847 -0.534114 -0.519556 0.257327 0.284331 0.216812 0.226415 0.289364 0.230560 0.230395 0.235873 0.234907 0.233707 0.195983 0.222758 0.223539 0.191660 0.226085 0.246154 0.221561 0.228109 0.213705 0.259090 0.232769
chargesum: 0.00000
title: Mulliken charges with hydrogens summed into heavy atoms:
elementType: O O O O O N C C C C C C C C C C C C C C C C
charge: -0.234514 -0.292614 -0.279335 -0.280273 -0.230281 -0.097640 0.207741 0.205525 0.214307 0.041362 -0.296695 -0.201747 0.232944 0.088731 0.226175 -0.061754 0.184148 0.164281 0.037482 0.024437 0.161710 0.186008
polarizability: 3.66750120e+02 -2.86677597e+00 1.97437459e+02 -1.33806320e+01 -2.75270343e+00 1.20192150e+02
1716.lowfreq: -12.6077 -5.1508 -0.0008 -0.0005 0.0006 2.2900 12.0974 16.4557 20.9151
frequency: 8.6242 15.0669 20.6176 53.2359 61.1946 64.2182 77.3224 83.5115 90.2035 100.1658 109.8129 154.8063 171.4129 180.8292 189.7107 194.2285 207.6431 223.0191 238.3978 250.3805 260.2474 279.2563 295.0809 320.9575 350.3744 351.2654 377.1889 382.4710 406.9588 411.9337 429.1321 456.0734 475.8082 516.2413 559.0579 591.3298 611.9256 651.2079 701.6321 710.4889 715.9209 721.7158 739.9727 767.8916 798.4629 818.5634 838.9108 839.5002 872.3904 913.8442 929.5285 980.9846 1026.7322 1036.8806 1037.5199 1044.1563 1054.4577 1065.4954 1069.9325 1077.9535 1091.2330 1111.1693 1113.3737 1124.2197 1139.2935 1150.7916 1156.4848 1171.8454 1182.4858 1198.9724 1232.5294 1258.5856 1269.7561 1295.5887 1299.0711 1322.9238 1344.1591 1375.2144 1388.5006 1397.2780 1419.0477 1422.1078 1430.1126 1440.0468 1449.4746 1453.7818 1456.6035 1460.7340 1461.8453 1466.3428 1468.7975 1472.5553 1475.0772 1479.4889 1480.8376 1482.2230 1483.7559 1486.5094 1558.9806 1586.1971 1627.5111 1635.0920 2857.0055 2871.5013 2900.1482 2960.7635 2976.5955 2979.2883 3018.5614 3028.6045 3039.9386 3044.4805 3045.6167 3049.6153 3077.3470 3088.6832 3089.1799 3126.1309 3126.6099 3131.6757 3132.3187 3165.2091 3191.5908
redmass: 4.1398 3.2678 3.7682 3.8972 3.6903 2.5746 1.1427 3.4693 2.4484 2.8030 4.1892 1.5857 2.5390 3.1792 3.1995 2.2508 1.1657 2.3325 2.1725 2.5412 1.5119 3.6310 3.5759 4.4999 3.5164 3.6551 4.7485 5.3585 4.6370 2.8854 3.6532 3.9971 4.0261 5.7701 5.6218 7.4103 4.2811 5.8930 7.7349 5.6287 8.8630 4.0785 2.8291 5.4835 1.6607 3.5919 2.3981 2.0683 1.4821 7.0742 5.8037 5.0757 2.5201 2.3043 1.8889 1.4817 3.8029 2.0384 2.5720 3.9079 1.3268 1.2379 1.2589 2.5430 1.4727 1.5423 1.4718 3.4117 1.6397 4.3541 1.3679 1.5811 2.3463 4.2972 1.3100 1.4894 4.6494 1.4164 3.8103 1.2980 1.6486 1.1411 1.3895 1.1302 1.1307 1.3329 1.2274 1.0733 1.4416 1.0538 1.0574 1.3063 1.0590 1.0854 1.1536 1.0484 1.7143 1.0554 6.3010 9.2932 7.8623 10.7087 1.0565 1.0567 1.0687 1.0329 1.0402 1.0344 1.0730 1.0744 1.0764 1.0736 1.0960 1.1040 1.1007 1.1006 1.0977 1.0996 1.1080 1.1047 1.0955 1.0910 1.0935
irintensity: 1.1071 0.7976 0.4904 1.4588 0.8139 5.0463 0.7388 0.5484 1.1931 1.3078 8.1316 3.5704 0.4765 0.4766 1.7944 0.7553 1.4693 1.4003 2.7386 0.7449 1.2491 8.6229 24.9157 7.3663 2.6015 16.7348 5.3148 0.1514 3.8446 7.8327 10.3150 8.7353 2.7109 0.9352 7.2722 5.7887 4.1014 0.7120 1.5546 4.2856 9.0091 23.7127 3.0309 23.1243 4.4804 9.9801 10.5327 18.3485 36.8274 49.5043 31.0813 61.5028 27.3611 320.6870 69.2692 2.4171 147.7132 80.9725 41.7741 65.6676 17.7879 17.1681 0.1995 56.5333 0.6378 13.6931 6.2743 90.7952 15.7790 394.6237 45.8262 10.4692 18.0248 6.8941 1.2551 20.4331 404.5399 55.5980 39.3021 31.0402 34.1863 2.5409 1.4448 0.8955 20.7489 51.9400 12.3443 18.1477 29.2223 13.8332 11.1736 35.6386 32.7310 13.3429 24.1718 17.5535 3.0652 8.3488 56.8751 7.4337 45.2539 473.5714 98.6384 138.3822 85.7856 54.8541 26.6934 103.5926 47.4869 37.9044 35.6510 24.2038 22.7918 45.0519 33.7927 46.6752 36.2499 23.5143 15.0366 17.1185 1.7495 6.6787 1.5628
temp: 298.150 k
press: 1.00000 atm
elementType: 8 8 8 8 8 7 6 6 6 6 6 6 6 6 6 6 6 6 6 6 6 6 1 1 1 1 1 1 1 1 1 1 1 1 1 1 1 1 1 1 1 1 1
symmnumber: 1
zpe: 904408.6 jmol-1
zpe.correction: 0.344471 hartree
zpe.thermalcorrener: 0.368407 hartree
zpe.thermalcorrenthalpy: 0.369352 hartree
zpe.thermalcorrgfe: 0.287244 hartree
zpe.sumelectzpe: -1051.445122 hartree
zpe.sumelectthermal: -1051.421185 hartree
zpe.sumelectthermalent: -1051.420241 hartree
zpe.sumelectthermalfe: -1051.502349 hartree
dipole: -2.0899 5.3045 -0.3631
dipole: 5.7129
quadrupole: -100.6851 -124.5873 -132.4820
quadrupole: -6.8738 12.0159 2.2793
quadrupole: 18.5664 -5.3358 -13.2306 -6.8738 12.0159 2.2793
hfenergy: -1051.7895926 hartree
pointgroup: C01[X(C16H21N1O5)]
dipole: 0.8515069 2.0462436 0.3736887 debye
polarizability: 367.2650548|0.9580468|195.9644889|-7.8514871|10.8358559|121.150185 unknown
InChI: InChI=1S/C16H21NO5/c1-10-11-8-13(19-4)14(20-5)9-12(11)22-15(10)16(18)21-7-6-17(2)3/h8-9H,6-7H2,1-5H3
charge 0 multiplicity 1
43 atoms
O  0.135382 -1.412342 -0.069481
O  -2.855747 0.544451 0.723881
O  5.155534 1.020043 -0.230264
O  4.952687 -1.731532 -0.78161
O  -2.627937 -1.729319 0.195151
N  -6.448694 0.292192 -0.447518
C  1.466306 0.467601 0.172427
C  0.093154 0.869086 0.423003
C  1.445823 -0.921805 -0.122268
C  -0.679127 -0.287326 0.269878
C  2.706407 1.15944 0.162748
C  2.59662 -1.66882 -0.405979
C  3.878153 0.438698 -0.138213
C  -4.996438 0.560672 -0.544964
C  3.827968 -0.983609 -0.408384
C  -0.343721 2.264309 0.772759
C  -4.330153 0.341661 0.827669
C  -2.109274 -0.600978 0.375074
C  -6.778624 -1.145806 -0.54903
C  -7.266099 1.114999 -1.360374
C  5.247627 2.471554 -0.060485
C  6.140267 -1.701341 0.100401
H  2.73995 2.23235 0.369966
H  2.573804 -2.738287 -0.624335
H  -4.844903 1.612136 -0.849245
H  -4.491955 -0.082249 -1.305341
H  -1.429015 2.313607 0.934036
H  0.167491 2.611369 1.691085
H  -0.073358 2.969546 -0.036718
H  -4.524723 -0.674685 1.2091
H  -4.669073 1.095094 1.554268
H  -6.175715 -1.730885 0.16555
H  -6.59117 -1.562239 -1.570396
H  -7.844281 -1.300392 -0.302203
H  -8.337481 0.939612 -1.15326
H  -7.08794 0.894404 -2.443406
H  -7.05865 2.186052 -1.188689
H  6.310202 2.7119 -0.211292
H  4.93569 2.779658 0.956601
H  4.633709 3.000077 -0.815201
H  5.87129 -2.053214 1.114954
H  6.569838 -0.688484 0.150145
H  6.848984 -2.403895 -0.363237
