program: Gaussian 09
title: 000218472
version: EM64L-G09RevD.01
frameworkgroup: C1[X(C12H12O2)]
method: RPBEPBE
basis: SDD
operation: Freq
keyword: #pfreq=noraman
keyword: PBEPBE/SDD
title: #p freq=noraman PBEPBE/SDD
converged: YES YES NO NO
title: Mulliken charges:
elementType: O O C C C C C C C C C C C C H H H H H H H H H H H H
charge: -0.231225 -0.385608 -0.376000 -0.609080 -0.579867 0.391050 0.195123 0.286507 -0.114240 -0.431179 -0.370517 -0.226445 -0.245455 -0.261894 0.214397 0.221457 0.237812 0.222144 0.260902 0.180851 0.235370 0.273558 0.228990 0.233711 0.295173 0.354464
chargesum: 0.00000
title: Mulliken charges with hydrogens summed into heavy atoms:
elementType: O O C C C C C C C C C C C C
charge: -0.231225 -0.031143 0.059854 -0.149124 -0.138114 0.391050 0.195123 0.286507 -0.114240 -0.195809 -0.096959 0.002545 -0.011744 0.033279
polarizability: 1.94218543e+02 1.40903380e-01 1.34891532e+02 -7.44158270e+00 -1.37066782e+00 7.67334764e+01
1716.lowfreq: -16.4276 -10.6554 -0.0008 -0.0007 -0.0003 3.3746 47.6457 94.6376 115.6360
frequency: 47.5972 94.5645 115.6330 153.6556 204.0674 241.8383 252.6476 297.2096 312.2206 320.2950 392.2496 401.3926 449.0926 482.7748 505.3276 557.3940 584.9188 608.8973 643.5319 706.2797 722.2475 743.2833 770.8616 795.0088 815.7541 866.3025 887.7548 894.9705 925.4791 961.6818 963.7866 995.4596 1025.1480 1044.2957 1061.5927 1092.4920 1111.5017 1126.9920 1164.1012 1174.9525 1181.1243 1213.5929 1246.2375 1265.8301 1287.0212 1302.1267 1312.8197 1326.2812 1343.6977 1355.5639 1378.1131 1435.6399 1461.8993 1472.8535 1478.8750 1482.5847 1514.5183 1576.7215 1607.6297 1631.2783 2948.4135 2982.8059 2993.8759 3022.0475 3042.6259 3057.1571 3118.8224 3135.4981 3149.7601 3165.6743 3188.4103 3521.6889
redmass: 6.7739 4.5332 4.1255 3.4847 3.4190 3.5711 2.2742 5.8763 4.1319 2.9267 2.5982 3.6169 3.8499 3.0273 3.0849 2.2745 3.2614 2.7909 5.9936 4.0385 3.5045 1.6736 1.6040 2.7657 2.8524 3.7980 1.6585 2.0672 1.3878 2.3122 1.4917 1.3422 1.9615 2.1597 2.2841 2.4734 1.8404 2.1330 1.1633 1.0678 1.5684 2.0288 1.3555 2.0684 1.4883 1.3406 2.4596 1.3253 1.4644 1.4531 6.5057 2.3945 1.1783 2.0529 1.1266 1.1061 10.7182 6.6007 6.3320 7.1663 1.0672 1.0596 1.0629 1.0938 1.0996 1.1032 1.0871 1.0888 1.0936 1.1002 1.0938 1.0647
irintensity: 0.8262 1.2629 2.8514 0.8176 0.4441 2.5665 3.3397 0.6974 4.7070 0.8111 3.6292 5.5892 7.0694 2.2424 11.9581 64.0640 26.4397 2.4741 8.4169 36.8624 7.9394 0.5370 63.5778 13.3270 1.6038 44.0656 10.1818 25.9332 45.5718 37.9620 14.1084 1.8419 5.7043 0.1828 40.8103 63.7107 141.0824 82.9159 13.6251 0.7537 34.4802 10.0610 23.5945 13.6354 2.6950 8.2791 65.2245 5.3894 3.2443 2.6028 3.1651 11.7467 1.1830 5.3571 6.3095 37.5926 195.2498 7.5521 96.0075 258.9916 51.6446 52.0546 31.9018 3.9537 31.8204 41.6684 6.3933 11.3615 15.5365 28.3220 0.3035 28.7309
temp: 298.150 k
press: 1.00000 atm
elementType: 8 8 6 6 6 6 6 6 6 6 6 6 6 6 1 1 1 1 1 1 1 1 1 1 1 1
symmnumber: 1
zpe: 548586.1 jmol-1
zpe.correction: 0.208945 hartree
zpe.thermalcorrener: 0.220730 hartree
zpe.thermalcorrenthalpy: 0.221674 hartree
zpe.thermalcorrgfe: 0.171185 hartree
zpe.sumelectzpe: -613.901188 hartree
zpe.sumelectthermal: -613.889403 hartree
zpe.sumelectthermalent: -613.888459 hartree
zpe.sumelectthermalfe: -613.938949 hartree
dipole: -0.6805 4.5389 1.6913
dipole: 4.8913
quadrupole: -76.9238 -83.4740 -83.1427
quadrupole: 6.2629 1.9305 -2.6435
quadrupole: 4.2564 -2.2938 -1.9625 6.2629 1.9305 -2.6435
hfenergy: -614.1101335 hartree
pointgroup: C01 [X(C12H12O2)]
dipole: -0.2963306 1.784607 0.6562397 debye
dipolederiv: -0.6736536 0.1137034 0.0010559 -0.0834309 -0.9411757 -0.2118043 -0.1689963 -0.1758836 -0.3773263 -1.4810572 -0.1745924 -0.0937956 -0.7212709 -0.314849 0.0803912 -0.3399547 0.0610816 -0.3257102 0.1630127 0.0020456 -0.0416846 0.0026382 0.1137769 0.0060622 0.0235265 0.0553651 0.0777764 -0.0229282 -0.1049951 -0.0154692 -0.0530143 0.0777857 0.0061007 0.0160058 -0.0402964 0.0811084 0.0358514 0.0158696 0.0078129 0.0735259 0.0355253 -0.0010753 -0.0125213 -0.0218882 0.1078712 0.1997464 0.1608604 -0.0821962 -0.0724017 0.1152126 -0.0326306 -0.1702562 -0.07216 -0.0264894 -0.5860226 0.148075 0.0556464 0.050399 -0.1301486 -0.0248696 0.0858143 -0.0035651 -0.0337095 -1.2699972 -0.2478487 -0.1151634 -0.0703859 -0.1503394 0.0454675 0.0194636 0.0993612 -0.1204527 1.7973528 -0.0653522 0.0632047 0.29453 0.9009539 0.2748957 0.2805762 0.2042852 0.1758357 -0.2568564 -0.1374279 0.0330122 -0.1012432 0.0493169 -0.0528933 0.0425968 -0.0292656 -0.1543564 0.0769431 -0.1201944 -0.0108164 0.1173266 0.0345243 -0.0527463 0.0120856 -0.0187476 -0.1090181 0.1163093 -0.039948 -0.0395569 -0.0241031 0.0476268 -0.0371858 -0.0452687 -0.0475043 -0.1105471 -0.0381258 0.1552383 -0.0674083 0.1288129 -0.0726896 -0.0519968 -0.0618254 -0.0528692 -0.1424041 1.693673 0.1757795 0.030792 0.2553716 0.1509955 0.1019243 0.0852651 0.0864522 0.0452541 -0.1174202 -0.152113 0.0670434 -0.0484206 -0.009348 0.0546558 0.039624 0.0622518 0.0053386 0.0240768 0.1139791 0.0481697 0.0566646 -0.0784404 -0.0944889 0.0053139 -0.1090587 -0.0366393 0.0011399 -0.0166835 0.0970232 -0.0229968 0.0100923 -0.0892301 0.0798241 -0.0347985 -0.031482 -0.0166836 0.1080144 -0.0791925 0.0527551 -0.0808139 0.093003 -0.0357388 0.0677531 0.0360638 0.0248505 0.0022799 0.1313119 0.019192 0.013387 0.0410104 0.0920109 0.022199 -0.0082036 -0.1915872 -0.0677327 -0.1676677 -0.0462233 0.0195574 -0.0389362 -0.0873534 -0.0388265 0.0141176 0.0743256 0.0229396 0.0097588 0.0737302 -0.0979498 0.0617514 0.0070076 0.0749097 0.1201833 0.1077682 0.0538359 -0.0042756 0.0064804 -0.0165664 0.0496828 -0.0197049 0.028892 0.1401343 -0.1190594 0.0574855 0.031931 0.0725209 0.0734162 0.0104836 0.030715 0.0099296 0.145622 -0.0412944 -0.0854291 0.0559256 -0.1009007 0.008673 0.0567105 0.064251 0.0615263 0.1340157 0.1075448 0.0005544 0.0103934 0.004262 0.0769223 -0.0684485 -0.0147974 -0.0698718 0.1347743 0.3920911 0.0816564 0.0741453 0.1361821 0.1645546 -0.1258334 0.072337 -0.1192713 0.2582432 unknown
polarizability: 194.1083504|1.1576495|134.8955901|-8.0720148|-1.8644979|76.8396101 unknown
InChI: InChI=1S/C12H12O2/c13-8-10-6-3-5-9-4-1-2-7-11(9)12(10)14/h1-2,4,7-8,13H,3,5-6H2
charge 0 multiplicity 1
26 atoms
O  0.786602 -2.31231 -0.563415
O  4.208935 0.006198 0.090949
C  0.963915 2.226382 0.157393
C  -0.075918 1.764798 -0.901971
C  1.495841 1.037665 1.007205
C  -1.120416 0.797083 -0.361849
C  -0.785418 -0.557584 -0.047019
C  1.757812 -0.225397 0.200164
C  0.614635 -1.107809 -0.176946
C  -2.469931 1.206345 -0.224723
C  -1.801742 -1.461809 0.357708
C  -3.470954 0.309723 0.212305
C  -3.1369 -1.034714 0.498515
C  3.011565 -0.639017 -0.1756
H  1.799214 2.727259 -0.369556
H  0.509609 2.973164 0.836724
H  0.471636 1.280326 -1.733137
H  -0.575348 2.654371 -1.327324
H  0.750585 0.799651 1.788751
H  2.402192 1.363035 1.562303
H  -2.74021 2.238366 -0.479896
H  -1.51783 -2.501464 0.55164
H  -4.50642 0.653902 0.313688
H  -3.909944 -1.73956 0.822848
H  3.168781 -1.56042 -0.741855
H  4.069109 0.820516 0.641896
