program: Gaussian 09
title: 000218468
version: EM64L-G09RevD.01
frameworkgroup: C1[X(C19H23N3O2)]
method: RPBEPBE
basis: SDD
operation: Freq
keyword: #p
keyword: freq=noraman
keyword: PBEPBE/SDD
title: #p freq=noraman PBEPBE/SDD
converged: YES YES NO NO
title: Mulliken charges:
elementType: O O N N N C C C C C C C C C C C C C C C C C C C H H H H H H H H H H H H H H H H H H H H H H H
charge: -0.275500 -0.251242 -0.187921 -0.304532 -0.225790 0.318749 -0.075604 0.175325 0.154986 -0.544446 -0.369065 0.118474 0.197129 -0.810046 -0.648701 -0.342381 0.420541 -0.607159 -0.701356 -0.368090 -0.342977 -0.221970 -0.217731 -0.239362 0.236865 0.183812 0.233075 0.186353 0.250060 0.234894 0.234477 0.261375 0.246820 0.256293 0.206955 0.185305 0.270160 0.247579 0.244134 0.216833 0.205693 0.213424 0.268260 0.268246 0.232763 0.232257 0.233035
chargesum: 0.00000
title: Mulliken charges with hydrogens summed into heavy atoms:
elementType: O O N N N C C C C C C C C C C C C C C C C C C C
charge: -0.275500 -0.251242 -0.187921 -0.304532 -0.225790 0.318749 -0.075604 0.175325 0.154986 -0.123768 0.050364 0.118474 0.197129 -0.090614 0.115786 0.049879 0.420541 0.154714 -0.065405 -0.099830 -0.074731 0.010792 0.014526 -0.006327
polarizability: 3.19275098e+02 -1.25063970e+01 2.39730223e+02 1.67559715e+01 9.02612465e+00 1.58002125e+02
1716.lowfreq: -6.5484 -4.7889 -3.5658 -0.0009 0.0003 0.0007 20.0642 29.9127 45.2283
frequency: 19.8732 29.6530 45.2172 60.7680 66.6208 71.1291 83.9965 95.9188 113.7158 121.6379 126.9004 134.1260 159.3332 188.0666 188.7669 202.9373 226.5873 232.4425 240.4144 262.5953 268.5384 281.5063 308.9195 316.8106 333.2400 353.9669 380.5427 408.6045 409.2276 428.8862 436.2754 448.7755 510.9442 519.3992 589.1578 603.2512 613.2067 634.0151 651.2470 670.7386 695.5072 704.0909 728.9892 741.9279 746.5114 760.2175 782.9561 803.6967 818.7469 847.2647 896.0526 910.9828 916.9025 924.3880 974.8915 983.8167 989.2940 993.8271 997.6961 1010.2261 1025.4619 1034.6681 1041.6718 1069.1104 1078.0581 1091.7719 1106.9436 1116.5378 1125.5305 1130.3265 1142.1241 1172.8902 1182.0342 1200.4945 1215.1486 1221.8164 1248.1931 1258.5238 1275.0128 1278.1808 1288.3151 1303.0611 1315.0113 1325.7201 1348.5036 1350.3583 1380.8547 1388.2224 1402.8451 1419.0781 1428.5067 1440.2809 1456.1811 1458.7632 1464.2478 1465.4271 1472.5935 1474.8446 1476.5819 1477.2464 1478.4291 1479.8043 1482.9048 1486.9917 1487.2484 1511.3903 1539.7396 1593.9477 1596.7917 1602.9007 1612.3488 1638.8711 2959.3949 2960.7300 2969.0676 2971.0899 2979.6521 2998.6495 3008.8674 3009.8941 3027.6773 3032.2060 3054.5101 3067.0955 3070.7800 3090.1310 3092.5325 3101.0789 3120.4399 3129.7444 3136.3975 3138.9113 3150.7522 3164.9908 3180.7713
redmass: 4.3913 3.7950 5.3477 4.3488 2.0591 2.6881 3.4813 3.6868 2.3762 1.4317 2.7493 2.5710 1.0783 2.3059 1.2875 3.3726 2.2783 1.5376 4.4101 3.9168 3.0228 4.0666 4.8670 2.8230 3.8935 3.6475 7.9482 3.1624 4.2641 4.5186 6.2920 5.9696 3.5693 5.8930 5.0937 5.4827 6.4117 8.6098 4.7592 5.3023 2.3462 7.4181 1.1945 2.0463 3.6367 6.2106 1.6600 2.0747 5.3942 1.2613 1.8307 1.7595 1.7366 1.6292 1.3794 2.3298 5.3352 2.0677 1.7953 3.5555 2.1217 1.9823 1.4443 2.5473 1.7447 3.0207 2.2285 1.3380 1.8083 1.3068 2.4042 1.0528 1.1317 2.9458 2.9411 1.6809 3.1036 1.3933 6.6152 1.7577 1.1814 1.8163 1.3498 1.4168 1.5838 4.6177 9.0278 1.2149 1.2841 1.2730 1.9733 2.1212 1.4103 1.3431 1.1297 1.1436 1.1008 1.0695 1.0800 1.0442 1.0994 1.8177 1.0747 1.2315 1.1391 4.0482 7.3426 6.6742 7.0778 7.0691 8.9909 10.0928 1.0414 1.0586 1.0579 1.0411 1.0636 1.0375 1.0956 1.0328 1.0966 1.0969 1.1027 1.1000 1.1003 1.0973 1.0945 1.1021 1.1012 1.0856 1.1020 1.0890 1.0942 1.0984 1.0981
irintensity: 0.1787 0.8433 1.3964 0.1953 0.2975 0.5945 1.9884 3.1815 0.2801 1.0273 2.8173 0.1641 0.2451 0.4479 0.2349 1.8669 0.4127 0.1472 2.2130 2.8988 2.4998 3.0116 3.6042 2.3903 1.9159 8.6039 9.4201 2.5861 4.4694 11.9351 3.6669 7.4864 16.5528 14.4608 4.9262 9.0688 1.0517 3.1851 2.1741 3.2907 29.1588 6.4086 3.2024 53.4457 9.3120 10.5916 12.0248 8.1563 6.0372 0.4334 6.1116 10.3907 2.8766 7.9896 0.3343 62.5169 0.5872 16.1274 6.3936 3.6372 3.7304 14.6905 1.5841 0.7324 19.8198 24.5163 11.2992 3.8431 2.3797 0.1862 4.3770 0.0117 0.7923 5.0886 1.4396 0.5647 13.8941 1.7019 177.6818 26.0545 8.3086 35.5195 1.1302 1.5392 7.1414 59.1450 2.3042 11.2608 9.2434 79.2674 16.2764 6.4903 29.9588 23.4296 19.3287 7.3523 25.6823 10.7045 19.6313 10.0768 17.4497 33.7061 7.2524 6.8874 14.7752 218.4577 43.0060 8.5380 10.0428 80.3852 561.5957 341.3819 50.0433 28.8251 15.3769 51.1751 65.2981 45.7050 10.1454 34.7830 22.6238 3.1818 12.8902 74.5445 78.3256 14.1955 13.7321 18.3684 10.9635 2.3100 0.9283 4.1871 22.4590 25.3429 3.1191
temp: 298.150 k
press: 1.00000 atm
elementType: 8 8 7 7 7 6 6 6 6 6 6 6 6 6 6 6 6 6 6 6 6 6 6 6 1 1 1 1 1 1 1 1 1 1 1 1 1 1 1 1 1 1 1 1 1 1 1
symmnumber: 1
zpe: 1011704.7 jmol-1
zpe.correction: 0.385338 hartree
zpe.thermalcorrener: 0.409288 hartree
zpe.thermalcorrenthalpy: 0.410232 hartree
zpe.thermalcorrgfe: 0.330944 hartree
zpe.sumelectzpe: -1050.804794 hartree
zpe.sumelectthermal: -1050.780844 hartree
zpe.sumelectthermalent: -1050.779899 hartree
zpe.sumelectthermalfe: -1050.859188 hartree
dipole: 2.6222 -6.0733 1.0039
dipole: 6.6909
quadrupole: -139.9232 -137.8172 -139.6029
quadrupole: -6.0072 -0.9221 2.0824
quadrupole: -0.8087 1.2972 -0.4885 -6.0072 -0.9221 2.0824
hfenergy: -1051.1901316 hartree
pointgroup: C01 [X(C19H23N3O2)]
dipole: -1.0585037 2.409995 0.0320728 debye
polarizability: 319.4645997|-14.0581305|234.8097549|-15.1328686|-20.9826908|162.7330922 unknown
InChI: InChI=1S/C19H23N3O2/c1-5-6-12-15-13(2)20(3)17-16(15)18(23)21(4)19(24)22(17)14-10-8-7-9-11-14/h7-11H,5-6,12H2,1-4H3
charge 0 multiplicity 1
47 atoms
O  2.371969 -2.224567 -0.427504
O  -2.118114 -2.592847 0.888485
N  -0.137268 1.727172 -0.051876
N  -1.339295 -0.442937 0.328099
N  0.130037 -2.364886 0.289446
C  1.947603 0.897663 -0.563357
C  1.045454 -0.19929 -0.277546
C  -0.224009 0.343353 0.004345
C  1.203444 2.071254 -0.422165
C  3.413923 0.774568 -0.901339
C  4.316031 0.548091 0.343612
C  1.28276 -1.62167 -0.181154
C  -1.158926 -1.851332 0.535129
C  1.621133 3.504406 -0.583414
C  -1.163231 2.71412 0.318713
C  5.808313 0.407054 -0.029844
C  -2.705309 0.034509 0.189928
C  0.282654 -3.823271 0.496414
C  6.7163 0.191208 1.199699
C  -3.126799 0.563916 -1.053191
C  -3.609926 -0.070415 1.269889
C  -4.455137 1.019105 -1.204243
C  -4.938898 0.378204 1.107822
C  -5.363763 0.929714 -0.123947
H  3.557943 -0.082682 -1.584895
H  3.758215 1.682111 -1.436437
H  3.978552 -0.370766 0.860177
H  4.184964 1.38958 1.055083
H  2.649701 3.539149 -0.9779
H  0.974758 4.058981 -1.290703
H  1.622517 4.062547 0.374465
H  -1.761243 2.34678 1.167212
H  -0.662882 3.645834 0.623913
H  -1.850021 2.934429 -0.517567
H  5.923092 -0.44497 -0.729902
H  6.137979 1.312563 -0.58116
H  1.329343 -4.072973 0.269291
H  -0.398845 -4.377406 -0.170006
H  0.035889 -4.084935 1.538308
H  6.424332 -0.72355 1.748936
H  6.642899 1.042304 1.903511
H  7.777422 0.085376 0.906881
H  -2.423675 0.603544 -1.892697
H  -3.277306 -0.515341 2.211248
H  -4.782291 1.426806 -2.166974
H  -5.643379 0.292004 1.942011
H  -6.396212 1.275289 -0.244297
