program: Gaussian 09
title: 000218467
version: EM64L-G09RevD.01
frameworkgroup: C1[X(C15H15N3O2)]
method: RPBEPBE
basis: SDD
operation: Freq
keyword: #p
keyword: freq=noraman
keyword: PBEPBE/SDD
title: #p freq=noraman PBEPBE/SDD
converged: NO YES NO NO
title: Mulliken charges:
elementType: O O N N N C C C C C C C C C C C C C C C H H H H H H H H H H H H H H H
charge: -0.274684 -0.251016 -0.298120 -0.449842 -0.232499 0.208909 -0.028627 0.190104 0.241100 0.124994 0.197119 0.423381 -0.831650 -0.811457 -0.606133 -0.418264 -0.329424 -0.216807 -0.215325 -0.239011 0.338244 0.291546 0.223431 0.222701 0.258210 0.234590 0.235388 0.271289 0.247740 0.244702 0.276028 0.269536 0.234008 0.234558 0.235279
chargesum: 0.00000
title: Mulliken charges with hydrogens summed into heavy atoms:
elementType: O O N N N C C C C C C C C C C C C C C C
charge: -0.274684 -0.251016 -0.298120 -0.111599 -0.232499 0.208909 -0.028627 0.190104 0.241100 0.124994 0.197119 0.423381 -0.093972 -0.083269 0.157598 -0.142236 -0.059887 0.017201 0.019233 -0.003731
polarizability: 2.56637431e+02 7.19480488e+00 2.10442991e+02 6.44648611e+00 -1.13919134e+01 1.12823014e+02
1716.lowfreq: -67.1289 -8.0877 -4.0540 -0.0004 -0.0003 0.0002 3.8699 40.5653 52.0515
frequency: -67.1096 40.5574 52.0448 71.0687 78.1811 88.1259 99.0012 122.4308 130.5069 185.9869 194.9047 229.4141 239.3706 255.9436 274.1304 289.3083 329.1645 347.9454 381.6368 404.5903 407.1813 421.6583 434.8151 495.8784 508.0199 573.2697 587.6025 613.0451 626.9964 636.3457 639.8916 683.3552 697.2914 701.7302 741.7721 751.6192 760.7904 791.8171 846.3648 867.4451 919.2174 949.1261 966.4478 974.1976 989.2194 995.0125 996.3333 1024.8056 1032.9844 1052.8358 1075.4730 1089.5154 1104.1872 1131.0430 1144.5754 1174.1667 1184.9342 1207.3101 1238.0028 1246.0990 1279.1629 1293.1885 1315.8284 1353.9719 1382.7334 1400.8823 1406.5839 1420.3466 1438.9425 1448.5671 1467.0354 1468.3919 1475.0473 1477.7873 1480.7110 1484.6698 1492.9287 1514.0804 1563.1787 1594.4790 1602.9245 1608.3794 1620.0694 1644.5411 2962.9736 2975.3322 3010.0715 3029.6748 3048.2158 3094.8518 3100.8102 3101.4407 3131.6362 3137.0512 3141.4065 3152.9611 3167.0286 3184.8026 3585.6045
redmass: 1.0401 5.3652 3.8473 4.7185 1.2426 3.6119 2.4245 1.2056 3.3804 3.9791 4.5399 4.2909 2.7317 5.5951 4.3891 4.7436 5.1992 3.4752 9.6923 5.9162 2.9943 6.2501 6.4480 5.2660 3.6464 1.2274 6.1739 6.3838 4.1212 5.1064 6.6506 5.5264 2.3615 9.1586 2.1840 9.5100 4.0044 3.1010 1.2667 6.4516 1.4147 2.6080 1.5832 1.3757 4.7188 2.2705 1.4433 2.1891 1.3765 1.4932 1.9799 2.6278 3.7566 1.3057 3.1957 1.0524 1.1264 3.7718 2.1199 3.1658 6.0594 4.6918 1.4026 2.9877 9.0234 1.2607 1.2230 1.2538 2.2747 2.4790 1.1669 1.0448 1.0745 1.0819 1.5408 1.8876 1.0467 6.9875 7.8564 6.6113 7.0258 6.4633 7.9122 9.4481 1.0394 1.0386 1.0328 1.0982 1.0979 1.0948 1.0973 1.1021 1.0856 1.1021 1.0890 1.0943 1.0988 1.0976 1.0807
irintensity: 0.1514 0.4186 0.8618 0.5742 0.1096 2.7468 2.5557 0.5393 3.5515 0.3992 2.7755 0.7103 1.8238 5.3186 2.4749 0.1289 2.5218 15.7285 10.9385 3.6869 0.7094 9.7761 11.6647 1.2592 24.7545 66.2842 8.9619 0.8775 3.3362 5.0850 14.9828 20.3508 17.8444 5.8904 38.9740 9.8453 10.5997 19.8099 1.4921 5.5109 0.8661 12.0014 6.3561 2.7413 0.3663 101.3466 8.0606 4.0371 4.4870 0.0519 6.2883 9.6895 14.2257 0.1173 6.9491 0.0441 0.2980 2.8458 26.6700 22.7855 199.6928 39.8719 0.8412 23.6048 2.0832 3.4312 20.2760 74.3544 36.7110 8.8321 2.4171 19.1332 20.1137 24.9908 94.5613 6.9586 9.1187 219.0671 19.2634 11.7259 44.8772 107.3093 554.8556 363.5277 60.2913 48.6973 34.0973 23.5386 23.0901 10.3465 0.6224 18.7307 2.4752 0.9541 5.1229 21.9529 22.4048 2.0799 53.5053
temp: 298.150 k
press: 1.00000 atm
elementType: 8 8 7 7 7 6 6 6 6 6 6 6 6 6 6 6 6 6 6 6 1 1 1 1 1 1 1 1 1 1 1 1 1 1 1
symmnumber: 1
zpe: 718686.4 jmol-1
zpe.correction: 0.273733 hartree
zpe.thermalcorrener: 0.291405 hartree
zpe.thermalcorrenthalpy: 0.292349 hartree
zpe.thermalcorrgfe: 0.227922 hartree
zpe.sumelectzpe: -893.924301 hartree
zpe.sumelectthermal: -893.906629 hartree
zpe.sumelectthermalent: -893.905685 hartree
zpe.sumelectthermalfe: -893.970112 hartree
dipole: -3.1766 -5.7166 -0.5049
dipole: 6.5594
quadrupole: -117.9719 -109.9925 -114.2177
quadrupole: 0.8549 1.1800 -3.5301
quadrupole: -3.9112 4.0682 -0.1570 0.8549 1.1800 -3.5301
hfenergy: -894.1980339 hartree
pointgroup: C01 [X(C15H15N3O2)]
dipole: -1.3428948 2.2035416 -0.0294207 debye
polarizability: 257.0289783|-6.0976397|206.2113607|-6.8281143|-21.9014183|116.6630972 unknown
InChI: InChI=1S/C15H15N3O2/c1-9-10(2)16-13-12(9)14(19)17(3)15(20)18(13)11-7-5-4-6-8-11/h4-8,16H,1-3H3
charge 0 multiplicity 1
35 atoms
O  3.484676 -1.663233 0.02517
O  -1.076943 -2.757852 0.32411
N  -0.532192 -0.481045 0.092845
N  0.366463 1.832334 -0.035748
N  1.185836 -2.17233 0.170146
C  0.495535 0.460672 -0.000592
C  1.864762 0.142646 -0.025166
C  2.606534 1.390661 -0.085058
C  1.661674 2.420209 -0.089574
C  2.28972 -1.238915 0.045829
C  -0.192636 -1.86428 0.207641
C  -1.92321 -0.077054 0.039374
C  4.109185 1.530925 -0.129943
C  1.830146 3.910199 -0.14277
C  1.508626 -3.614874 0.26982
C  -2.370654 0.720163 -1.04314
C  -2.820452 -0.469414 1.059468
C  -3.71711 1.145459 -1.088559
C  -4.166598 -0.050013 0.997837
C  -4.617762 0.763556 -0.067972
H  -0.514051 2.345026 -0.008625
H  4.576898 0.534109 -0.096694
H  4.446593 2.035684 -1.054864
H  4.492449 2.117672 0.72606
H  2.903291 4.160117 -0.168789
H  1.365306 4.35619 -1.044038
H  1.394682 4.415478 0.741662
H  2.602679 -3.704481 0.204169
H  1.022177 -4.16926 -0.549193
H  1.144215 -4.021933 1.227481
H  -1.681773 0.970652 -1.857336
H  -2.469266 -1.10908 1.872763
H  -4.06385 1.756398 -1.929023
H  -4.863875 -0.359698 1.78344
H  -5.663375 1.08691 -0.108329
