program: Gaussian 09
title: 000218453
version: EM64L-G09RevD.01
frameworkgroup: C1[X(C21H16N4)]
method: RPBEPBE
basis: SDD
operation: Freq
keyword: #pfreq=noraman
keyword: PBEPBE/SDD
title: #p freq=noraman PBEPBE/SDD
converged: YES YES NO NO
title: Mulliken charges:
elementType: N N N N C C C C C C C C C C C C C C C C C C C C C H H H H H H H H H H H H H H H H
charge: -0.329860 -0.023272 -0.062783 -0.105906 0.204925 0.351682 0.408518 -0.113401 -0.366561 -0.367108 -0.351424 -0.328296 -0.384211 -0.239298 -0.233630 -0.217134 -0.210019 -0.238874 -0.245017 0.175673 -0.346941 -0.293319 -0.204673 -0.203601 -0.238462 0.286708 0.263144 0.261567 0.271788 0.276202 0.230591 0.231095 0.231757 0.231967 0.231981 0.232506 0.251525 0.275265 0.230262 0.227028 0.229606
chargesum: 0.00000
title: Mulliken charges with hydrogens summed into heavy atoms:
elementType: N N N N C C C C C C C C C C C C C C C C C C C C C
charge: -0.329860 -0.023272 -0.062783 -0.105906 0.204925 0.351682 0.408518 -0.113401 -0.079854 -0.103964 -0.089857 -0.056508 -0.108009 -0.008707 -0.002534 0.014622 0.021949 -0.006893 -0.012511 0.175673 -0.095416 -0.018054 0.025589 0.023427 -0.008856
polarizability: 5.16014814e+02 4.80564316e+00 2.78553486e+02 -1.65041210e+01 1.17041029e+01 1.29375641e+02
1716.lowfreq: -9.5694 -2.8152 -0.0006 -0.0005 -0.0004 1.8810 23.9793 27.6918 35.6416
frequency: 23.9245 27.5941 35.6061 41.6872 52.2169 70.0087 89.4026 111.7719 127.1378 164.7058 180.6001 218.9540 236.1792 269.0928 284.6272 311.6213 336.7830 383.2670 402.1390 407.7449 407.9456 413.4388 470.4904 497.0479 519.3447 524.3588 557.0668 607.6400 610.6036 613.0554 628.4468 648.6782 670.8240 690.9434 693.7039 697.0875 705.0409 718.9632 764.6064 768.1176 781.1754 782.3964 841.1308 848.2890 852.3867 868.9834 881.0791 914.0872 920.2315 929.4198 939.4558 972.2367 975.0147 984.8821 986.4738 988.1113 989.0527 992.9554 996.0921 997.1731 1000.0589 1014.2282 1016.5362 1031.0143 1043.7946 1076.0181 1082.3038 1090.7992 1140.8779 1156.2912 1168.5367 1169.8873 1173.3858 1174.7298 1187.3720 1196.3978 1204.1099 1273.3681 1303.4342 1318.7005 1322.0163 1347.7398 1366.1398 1375.6279 1383.2672 1387.1211 1394.0245 1427.7047 1435.0285 1442.7392 1446.9044 1462.8983 1479.4867 1488.8434 1529.3116 1581.5227 1581.8646 1597.5252 1601.8422 1609.9022 1612.1917 3127.0091 3128.9042 3133.5842 3138.3581 3138.8136 3144.9654 3151.9283 3152.3255 3161.2096 3163.7432 3164.5074 3171.1884 3174.2939 3175.1103 3181.8587 3243.2581
redmass: 4.5027 4.5618 5.3649 4.2313 4.4985 4.6174 5.4091 5.1732 5.4655 6.2370 6.1445 5.3806 5.0945 6.5354 5.1784 6.0421 5.5178 6.5830 2.8235 2.8946 2.9937 6.2434 6.0051 3.7344 3.8980 3.7008 6.2793 6.3701 6.4954 6.3240 6.3516 6.3733 6.7125 2.1261 2.1063 1.9924 2.7990 4.5568 1.6885 2.9314 3.3966 1.8400 1.2473 1.2490 1.2470 1.4096 7.0867 1.6620 1.5607 2.9907 1.4462 1.3848 1.3931 4.2409 1.5383 5.7849 6.1255 1.3269 1.4446 4.5390 1.3470 2.3495 2.9793 2.1584 2.1634 1.4879 1.6727 1.5977 2.8826 1.7662 1.4902 1.0947 1.0547 1.0550 1.1309 1.1219 2.4249 5.0379 1.4630 1.4420 1.3534 6.5017 4.4449 8.2944 6.7789 9.1458 7.5765 3.2945 2.4693 2.3843 2.4934 2.2578 2.9051 2.7296 6.2706 5.9485 6.1625 6.6835 6.2793 6.0882 6.0609 1.0851 1.0850 1.0854 1.0887 1.0887 1.0900 1.0938 1.0929 1.0949 1.0975 1.0955 1.1002 1.0965 1.0988 1.0982 1.0977
irintensity: 0.2941 0.2868 0.2167 0.7603 0.3621 0.1484 0.1379 1.8072 0.4259 1.2908 0.1060 1.7017 0.1784 0.4210 0.1920 0.0816 1.7477 0.9255 0.1348 0.0969 0.1860 1.9088 4.5998 2.7540 15.1219 4.4645 42.0980 0.2988 0.0281 0.3737 3.1119 6.9012 5.9221 36.1042 27.2105 44.2244 46.4794 23.3324 73.1983 2.4939 56.0548 62.5983 0.5873 0.8924 0.2481 20.6634 8.0785 10.0543 10.0458 6.4655 6.3448 1.1103 0.4503 1.0055 0.0997 0.8376 0.3920 0.6290 1.1865 21.9584 1.5927 9.2780 2.4843 1.6411 15.0395 8.7049 3.9895 11.2823 18.6024 2.0405 31.7461 1.3680 0.0425 0.0949 0.8625 0.6388 0.5778 0.2064 0.5365 8.9780 2.2992 27.9229 92.6100 19.6622 4.8288 34.2148 2.4942 38.3187 25.5915 2.7829 23.8954 38.3138 54.1631 208.1908 17.5839 3.1219 2.8499 3.5504 2.7889 44.9262 2.7794 1.9330 0.2301 0.6518 10.4347 5.2634 12.5071 24.3875 24.4281 40.5075 24.2897 20.2368 37.0604 8.6992 5.5729 4.0772 1.4951
temp: 298.150 k
press: 1.00000 atm
elementType: 7 7 7 7 6 6 6 6 6 6 6 6 6 6 6 6 6 6 6 6 6 6 6 6 6 1 1 1 1 1 1 1 1 1 1 1 1 1 1 1 1
symmnumber: 1
zpe: 829429.0 jmol-1
zpe.correction: 0.315913 hartree
zpe.thermalcorrener: 0.335762 hartree
zpe.thermalcorrenthalpy: 0.336706 hartree
zpe.thermalcorrgfe: 0.264876 hartree
zpe.sumelectzpe: -1027.088462 hartree
zpe.sumelectthermal: -1027.068612 hartree
zpe.sumelectthermalent: -1027.067668 hartree
zpe.sumelectthermalfe: -1027.139498 hartree
dipole: 1.1506 2.7655 -0.0243
dipole: 2.9954
quadrupole: -114.0950 -134.5852 -146.1610
quadrupole: 2.1856 -3.9821 3.5276
quadrupole: 17.5187 -2.9715 -14.5473 2.1856 -3.9821 3.5276
hfenergy: -1027.4043744 hartree
pointgroup: C01 [X(C21H16N4)]
dipole: 0.4922756 0.9738374 0.4451375 debye
polarizability: 514.9176767|8.1286233|240.8089667|-25.2932101|65.682754|168.2172978 unknown
InChI: InChI=1S/C21H16N4/c1-4-10-17(11-5-1)21-20(24-23-18-12-6-2-7-13-18)16-22-25(21)19-14-8-3-9-15-19/h1-16H
charge 0 multiplicity 1
41 atoms
N  1.735984 -1.043973 -0.699715
N  1.21016 -2.209481 -1.314683
N  -1.746935 -0.336893 -0.192512
N  -2.758933 -1.116374 -0.505588
C  0.734464 -0.207246 -0.21167
C  0.931366 1.139718 0.353926
C  3.1665 -0.959065 -0.581944
C  -0.491816 -0.877092 -0.497602
C  -0.128612 -2.091874 -1.178634
C  0.128998 1.570325 1.446344
C  1.873575 2.047465 -0.206706
C  3.769911 -0.447381 0.592101
C  3.961491 -1.453225 -1.643526
C  0.280672 2.86911 1.976248
C  2.01883 3.345347 0.324196
C  5.1772 -0.399484 0.682506
C  5.367338 -1.406776 -1.537073
C  1.227138 3.761052 1.421025
C  5.981595 -0.874326 -0.379375
C  -4.044266 -0.547793 -0.225225
C  -5.148679 -1.408709 -0.463081
C  -4.266908 0.77947 0.243037
C  -6.463833 -0.955838 -0.228518
C  -5.582395 1.223708 0.471685
C  -6.684866 0.360947 0.239504
H  -0.791989 -2.860749 -1.566871
H  -0.607639 0.882674 1.871222
H  2.478544 1.743839 -1.067198
H  3.151769 -0.101783 1.425046
H  3.470492 -1.876323 -2.523702
H  -0.339562 3.184108 2.822561
H  2.744518 4.033998 -0.122027
H  5.643377 -0.002844 1.59077
H  5.982415 -1.78841 -2.359109
H  1.344085 4.769139 1.833885
H  7.073467 -0.838716 -0.301554
H  -4.946526 -2.421266 -0.827763
H  -3.40364 1.43165 0.40812
H  -7.312696 -1.623536 -0.411521
H  -5.758251 2.245322 0.827552
H  -7.705741 0.716486 0.418667
