program: Gaussian 09
title: 000218446
version: EM64L-G09RevD.01
frameworkgroup: C1[X(C16H16O2)]
method: RPBEPBE
basis: SDD
operation: Freq
keyword: #pfreq=noraman
keyword: PBEPBE/SDD
title: #p freq=noraman PBEPBE/SDD
converged: YES YES NO NO
title: Mulliken charges:
elementType: O O C C C C C C C C C C C C C C C C H H H H H H H H H H H H H H H H
charge: -0.450982 -0.268554 -0.242908 -0.289643 -0.567754 0.349726 0.471579 0.136942 -0.413646 -0.439466 -0.387592 -0.360321 -0.353580 -0.402917 -0.257653 0.318950 -0.214533 -0.538516 0.261394 0.256704 0.226519 0.235810 0.283878 0.235172 0.228144 0.244871 0.236047 0.214779 0.224621 0.226317 0.355846 0.219160 0.218809 0.242797
chargesum: 0.00000
title: Mulliken charges with hydrogens summed into heavy atoms:
elementType: O O C C C C C C C C C C C C C C C C
charge: -0.095136 -0.268554 0.018486 -0.032939 -0.105424 0.349726 0.471579 0.136942 -0.129768 -0.204294 -0.159448 -0.115451 -0.117534 -0.188138 -0.033032 0.318950 0.011785 0.142250
polarizability: 2.69238162e+02 3.21987623e+00 1.78214603e+02 -1.27277775e+01 -2.28099248e+00 9.20400725e+01
1716.lowfreq: -9.3080 -3.5680 -0.0003 0.0004 0.0010 5.6910 20.4104 25.3791 45.7597
frequency: 20.1424 25.2419 45.7318 67.6160 87.4725 118.6470 163.6824 180.5790 207.8545 233.6048 255.9415 288.0795 335.8275 360.7012 364.4088 383.5790 417.6646 441.3822 475.5524 485.1579 501.1027 520.0568 548.3241 558.0016 591.5442 630.0908 673.2942 718.9337 735.0935 748.2023 751.0911 785.1912 810.6538 815.2042 840.0636 844.8038 881.4952 898.6820 928.0414 936.6167 945.1858 970.2020 982.0450 989.6332 997.7448 1010.8390 1045.1999 1064.8007 1075.8056 1085.5512 1106.8193 1112.0329 1117.6294 1151.2514 1156.7534 1163.6535 1174.0432 1178.4635 1215.8826 1224.2834 1237.6796 1252.5319 1299.8408 1304.3989 1318.3280 1363.6075 1391.4396 1404.3407 1415.1015 1435.3839 1436.2009 1463.1046 1465.7964 1473.7066 1499.2852 1507.5685 1578.4878 1597.5470 1615.1377 1623.1680 2955.1509 3040.9071 3082.1441 3096.8732 3109.2514 3117.2625 3120.8574 3124.6605 3132.5998 3135.4108 3146.3178 3157.6383 3163.1882 3166.1965 3195.5323 3578.5066
redmass: 4.8280 3.6083 5.1342 3.6070 4.0974 4.3604 4.4990 4.0355 2.4222 1.8563 2.3571 3.5510 4.1500 1.5625 2.3147 3.8667 2.9686 3.6726 3.2440 3.6348 3.9299 4.3060 2.9262 3.9463 4.5314 6.8925 3.2485 3.1435 3.5032 3.0006 1.3651 4.1579 3.7092 1.5220 1.4386 1.4576 5.1495 1.8621 1.5230 1.7956 1.8095 1.3142 1.3625 7.2807 2.2633 2.0533 1.8467 1.4911 1.7607 1.1667 1.3931 1.2613 1.4185 1.5890 1.3389 1.5661 1.1941 1.2622 1.8013 2.3061 1.8747 1.8709 1.5584 1.3121 1.6473 5.8652 5.5527 2.2695 3.3036 2.0933 1.2431 1.3090 1.0511 1.0732 2.6910 2.7573 7.3291 6.3785 6.8249 6.3186 1.0331 1.1037 1.0856 1.0586 1.0886 1.0884 1.0984 1.0893 1.0864 1.0895 1.0930 1.0941 1.0960 1.1004 1.1149 1.0658
irintensity: 0.1318 2.1144 0.2831 1.4833 0.0495 5.2193 0.5943 0.4145 1.5558 2.6291 4.1679 4.9501 2.3367 97.8742 27.5883 1.1481 0.1342 2.4871 11.3564 6.8706 12.0548 9.6453 16.4020 0.5724 0.2995 0.5518 12.3539 3.9882 6.0426 6.8547 89.4454 8.9709 21.3378 23.4931 6.5909 44.6536 17.3394 5.5503 3.8209 0.2748 0.5735 0.0590 0.2316 48.4092 4.8000 23.2936 12.1385 9.9847 73.6927 10.7924 6.6961 0.2049 13.7923 74.9251 12.2273 2.2285 7.3993 77.0500 62.4744 108.7314 3.6510 50.5641 17.6507 1.5043 0.7176 19.0646 5.8961 9.7533 5.8719 39.6815 0.8229 20.1548 13.1014 57.8389 139.6084 64.1126 4.2433 13.2864 4.3674 31.8658 76.1427 52.7323 9.5972 15.3960 14.4596 5.9980 36.7717 6.6921 3.1517 0.6366 26.7500 19.3996 8.0108 25.3370 18.9244 27.5436
temp: 298.150 k
press: 1.00000 atm
elementType: 8 8 6 6 6 6 6 6 6 6 6 6 6 6 6 6 6 6 1 1 1 1 1 1 1 1 1 1 1 1 1 1 1 1
symmnumber: 1
zpe: 720441.0 jmol-1
zpe.correction: 0.274401 hartree
zpe.thermalcorrener: 0.290646 hartree
zpe.thermalcorrenthalpy: 0.291590 hartree
zpe.thermalcorrgfe: 0.228817 hartree
zpe.sumelectzpe: -768.413266 hartree
zpe.sumelectthermal: -768.397021 hartree
zpe.sumelectthermalent: -768.396077 hartree
zpe.sumelectthermalfe: -768.458850 hartree
dipole: 0.1359 0.1692 -0.4942
dipole: 0.5397
quadrupole: -84.0709 -91.9641 -111.2686
quadrupole: -12.2495 -1.9182 -0.7055
quadrupole: 11.6969 3.8038 -15.5007 -12.2495 -1.9182 -0.7055
hfenergy: -768.6876674 hartree
pointgroup: C01 [X(C16H16O2)]
dipole: 0.0570251 -0.0469452 0.1990894 debye
polarizability: 269.6214221|-0.9016385|176.9560823|10.53168|-10.2532238|92.9153328 unknown
InChI: InChI=1S/C16H16O2/c1-18-12-8-6-11(7-9-12)14-10-15(14)13-4-2-3-5-16(13)17/h2-9,14-15,17H,10H2,1H3
charge 0 multiplicity 1
34 atoms
O  1.830938 1.965386 -0.679309
O  -5.196124 0.960512 -0.021969
C  1.22857 -0.749262 -0.684239
C  0.168509 -1.076713 0.396945
C  0.738183 -2.190154 -0.497548
C  2.60126 -0.290627 -0.303371
C  -1.247016 -0.585541 0.255207
C  2.88811 1.10444 -0.30615
C  -1.51205 0.774589 -0.063198
C  -2.346131 -1.447381 0.481179
C  3.650036 -1.165306 0.069009
C  -2.83133 1.255141 -0.149137
C  -3.679474 -0.982259 0.400541
C  4.16101 1.602873 0.047908
C  4.929807 -0.684348 0.43295
C  -3.919795 0.378077 0.085757
C  5.185694 0.704137 0.42156
C  -6.352525 0.096477 0.216501
H  0.812304 -0.221566 -1.550327
H  0.559515 -1.072809 1.423705
H  1.401433 -2.926645 -0.034015
H  0.088575 -2.598132 -1.278294
H  -0.666615 1.447822 -0.246489
H  -2.158357 -2.501072 0.721228
H  3.46434 -2.244804 0.058393
H  -3.045654 2.29994 -0.39527
H  -4.506154 -1.676539 0.580408
H  4.353721 2.684156 0.036151
H  5.720383 -1.387964 0.714031
H  6.172931 1.090337 0.697261
H  2.13443 2.907046 -0.673351
H  -6.344281 -0.315985 1.244719
H  -6.394018 -0.735423 -0.514026
H  -7.230128 0.746899 0.08604
