program: Gaussian 09
title: 000218440
version: EM64L-G09RevD.01
frameworkgroup: C1[X(C12H11N5O5)]
method: RPBEPBE
basis: SDD
operation: Freq
keyword: #p
keyword: freq=noraman
keyword: PBEPBE/SDD
title: #p freq=noraman PBEPBE/SDD
converged: YES YES NO NO
title: Mulliken charges:
elementType: O O O O O N N N N N C C C C C C C C C C C C H H H H H H H H H H H
charge: -0.221172 -0.188311 -0.184238 -0.313961 -0.242783 -0.399128 -0.144515 -0.316897 -0.344499 0.003010 -0.262528 0.194524 0.315448 0.052510 0.291755 0.221112 0.352092 -0.273472 -0.284163 -0.759174 -0.321018 -0.332345 0.296866 0.342564 0.361963 0.389552 0.274969 0.223086 0.263429 0.256306 0.247584 0.250505 0.250928
chargesum: 0.00000
title: Mulliken charges with hydrogens summed into heavy atoms:
elementType: O O O O O N N N N N C C C C C C C C C C C C
charge: -0.221172 -0.188311 -0.184238 -0.313961 -0.242783 -0.056564 -0.144515 0.045066 0.045053 0.003010 0.034338 0.194524 0.315448 0.052510 0.291755 0.221112 0.352092 0.001497 -0.061077 0.008145 -0.070513 -0.081416
polarizability: 3.26697238e+02 9.53852102e+00 1.88302535e+02 8.65850466e+00 1.03008546e+01 9.83293300e+01
1716.lowfreq: -5.1978 -2.9990 -0.0006 0.0003 0.0005 3.1339 18.0407 23.9482 34.5844
frequency: 17.9502 23.4642 34.5775 40.3762 60.4240 71.2677 82.4771 102.0092 123.6907 128.0504 154.4331 176.3684 180.2267 196.6945 279.9989 284.4084 298.1330 310.4774 361.1016 369.3080 405.0531 416.5056 457.5957 467.4163 486.3937 498.1676 530.2009 566.6396 589.4263 593.8021 615.2135 634.4290 659.7183 670.6732 674.3528 689.3260 697.7277 702.8685 747.6596 762.4557 786.8720 835.9874 868.8661 886.3836 888.8930 924.9117 960.0636 966.2798 992.0773 998.7396 999.4798 1036.0880 1044.8966 1056.8535 1066.0456 1093.9135 1174.2862 1192.9112 1205.3583 1215.1779 1223.5869 1224.8721 1262.6482 1285.7949 1288.4749 1302.0704 1331.2570 1384.0763 1386.2003 1402.2524 1451.0587 1452.6630 1455.1824 1477.7177 1517.4045 1540.4398 1571.2949 1581.4657 1594.6989 1636.8301 1652.8530 1667.8004 3009.8668 3026.0669 3101.3152 3134.5171 3144.4139 3147.4609 3156.8832 3176.1165 3423.6354 3466.0488 3503.8856
redmass: 6.1486 3.9830 8.4042 6.4572 1.3357 9.2174 2.5208 6.4789 7.5074 9.8462 7.0106 8.1579 8.3382 8.1050 5.5377 7.0535 6.0613 9.2898 2.4614 6.7881 6.9568 5.6619 5.7842 5.1326 10.4816 5.8142 1.8169 3.4825 2.0968 4.0319 6.7849 1.4959 6.9803 4.1152 5.8707 1.9786 4.9052 2.2519 2.9100 7.8843 4.8658 1.6231 6.3722 5.4595 1.2671 4.4839 6.6847 1.4548 1.4262 2.0588 6.2941 6.7101 1.6897 3.1108 2.0814 1.7801 3.3936 2.7447 2.5723 1.9263 1.5438 1.3527 2.4100 1.9460 2.0938 8.1918 1.4482 1.7034 1.4145 1.9034 1.0530 1.0614 2.2002 2.8712 6.8207 3.7698 5.0863 5.6499 9.3963 7.9621 9.4728 9.0196 1.0378 1.0812 1.0956 1.0880 1.0898 1.1017 1.0977 1.0967 1.0799 1.0803 1.0776
irintensity: 0.9362 0.3586 1.4010 1.4903 4.5283 6.1946 4.1396 2.1023 0.2864 0.6576 11.0641 10.3411 4.5979 3.5612 15.7930 14.9923 3.0824 1.2428 0.1975 17.4148 1.8117 5.6832 14.9388 7.3918 2.5940 10.8538 5.5261 2.0908 33.7457 7.2181 22.6141 93.2611 2.4748 11.7783 38.0880 161.6089 22.4220 19.4881 20.6690 12.7408 53.0881 48.2589 7.3173 10.2454 1.9719 0.9397 1.9682 0.5454 0.8684 4.8073 143.5619 60.9369 7.6536 3.5975 22.1243 6.5401 19.4226 207.3630 10.4430 5.2816 2.6763 2.7989 171.7634 52.5791 209.7412 5.7379 5.8458 411.6293 44.2243 39.6466 28.8148 25.7020 250.6489 411.4897 837.9857 18.2449 273.9440 130.7188 194.6975 243.6967 292.1561 182.6680 0.3868 5.7637 4.1203 6.0583 23.3725 6.2461 13.1248 5.2115 57.0370 315.7328 49.5847
temp: 298.150 k
press: 1.00000 atm
elementType: 8 8 8 8 8 7 7 7 7 7 6 6 6 6 6 6 6 6 6 6 6 6 1 1 1 1 1 1 1 1 1 1 1
symmnumber: 1
zpe: 612105.2 jmol-1
zpe.correction: 0.233139 hartree
zpe.thermalcorrener: 0.253185 hartree
zpe.thermalcorrenthalpy: 0.254130 hartree
zpe.thermalcorrgfe: 0.181080 hartree
zpe.sumelectzpe: -1112.165506 hartree
zpe.sumelectthermal: -1112.145459 hartree
zpe.sumelectthermalent: -1112.144515 hartree
zpe.sumelectthermalfe: -1112.217564 hartree
dipole: -0.0904 2.2352 -0.7569
dipole: 2.3616
quadrupole: -136.0285 -130.6510 -128.2984
quadrupole: 9.0090 -1.2257 -3.1377
quadrupole: -4.3692 1.0083 3.3609 9.0090 -1.2257 -3.1377
hfenergy: -1112.3986442 hartree
pointgroup: C01 [X(C12H11N5O5)]
dipole: 0.0426338 0.8910027 0.2599996 debye
polarizability: 326.7661167|-9.9919157|187.3670002|6.6263623|-13.9979085|99.1959857 unknown
InChI: InChI=1S/C12H11N5O5/c1-6(18)22-8-10(20)14-12(15-11(8)21)17-16-9(19)7-2-4-13-5-3-7/h2-5,8,14,16-17H,1H3
charge 0 multiplicity 1
33 atoms
O  4.636797 -0.566286 0.649744
O  4.17735 2.201495 0.052011
O  2.329226 -2.162834 0.874885
O  -2.884732 2.322103 -0.422493
O  3.868948 -0.563086 -1.542929
N  1.88772 1.822636 0.052282
N  0.902081 -0.345617 0.551861
N  -0.439245 1.43705 -0.020324
N  -1.515307 0.553537 0.078756
N  -6.252131 -1.517314 0.093691
C  3.357865 0.060478 0.997149
C  3.221871 1.436533 0.308289
C  0.81249 0.941172 0.213238
C  2.157236 -0.925533 0.773764
C  -3.933707 0.139081 -0.05686
C  -2.77316 1.077664 -0.149813
C  4.756879 -0.881089 -0.721882
C  -5.231463 0.687758 -0.203673
C  -3.816563 -1.257844 0.162916
C  6.038295 -1.621323 -0.98761
C  -6.348976 -0.169969 -0.120904
C  -4.994438 -2.034761 0.229626
H  3.446274 0.235273 2.086721
H  1.763695 2.745724 -0.376633
H  -0.7282 2.39338 -0.263194
H  -1.211322 -0.399868 0.324326
H  -5.343226 1.761577 -0.379025
H  -2.8500 -1.761039 0.274294
H  5.943078 -2.656102 -0.611866
H  6.876413 -1.147836 -0.451201
H  6.237979 -1.646051 -2.068255
H  -7.365668 0.222655 -0.228872
H  -4.939159 -3.115863 0.396584
