program: Gaussian 09
title: 000218437
version: EM64L-G09RevD.01
frameworkgroup: C1[X(C18H16N4O4)]
method: RPBEPBE
basis: SDD
operation: Freq
keyword: #p
keyword: freq=noraman
keyword: PBEPBE/SDD
title: #p freq=noraman PBEPBE/SDD
converged: YES YES NO NO
title: Mulliken charges:
elementType: O O O O N N N N C C C C C C C C C C C C C C C C C C H H H H H H H H H H H H H H H H
charge: -0.218762 -0.197787 -0.180858 -0.259971 -0.254037 -0.404150 -0.393932 0.042820 0.463497 0.408117 -0.250658 0.273074 0.152498 0.020026 -0.366808 -0.388269 -0.390792 -0.380959 -0.210957 -0.212335 -0.200781 -0.228110 -0.257200 -0.258419 0.342252 -0.750572 0.287396 0.305780 0.324190 0.269358 0.264113 0.227759 0.285268 0.228499 0.227203 0.225132 0.230354 0.230294 0.229901 0.263009 0.259228 0.245587
chargesum: 0.00000
title: Mulliken charges with hydrogens summed into heavy atoms:
elementType: O O O O N N N N C C C C C C C C C C C C C C C C C C
charge: -0.218762 -0.197787 -0.180858 -0.259971 -0.254037 -0.098370 -0.069742 0.042820 0.463497 0.408117 0.036738 0.273074 0.152498 0.020026 -0.097450 -0.124156 -0.163032 -0.095691 0.017542 0.014868 0.024352 0.002244 -0.026906 -0.028518 0.342252 0.017252
polarizability: 2.86336167e+02 -1.27115163e+01 2.71556056e+02 1.00536101e+01 6.52620800e+00 1.85144249e+02
1716.lowfreq: -4.0669 -0.0006 -0.0002 0.0006 1.9660 6.5656 20.4956 23.3979 27.6211
frequency: 20.4037 23.2825 27.5575 35.9382 42.8551 62.8421 65.8744 71.5136 85.4388 94.8890 113.5995 139.2301 166.8228 179.1939 217.0582 226.5309 247.2184 263.6851 284.2586 314.1417 341.5058 370.0127 403.1956 404.8145 406.1067 410.9993 451.9223 462.4869 475.7997 485.7690 508.8295 560.3479 564.8402 580.9362 609.7132 612.0530 618.5392 618.8231 636.2233 680.4844 688.5794 692.5851 697.6729 702.2835 742.8246 756.1878 765.6684 778.2874 796.4338 831.7918 845.0608 880.0671 899.3558 912.7470 913.9144 926.5832 967.3550 967.4702 975.3134 983.2555 986.0170 988.1189 991.0604 998.1239 1012.7632 1023.9696 1028.0254 1046.0300 1084.1560 1091.5833 1120.2492 1171.2430 1172.8960 1184.1899 1192.6978 1196.6376 1201.7737 1223.3386 1245.2228 1271.5257 1292.7435 1295.3726 1303.0167 1322.6988 1335.2174 1377.7749 1386.3276 1388.2099 1418.5762 1440.7439 1450.4327 1450.9435 1453.6598 1478.9467 1484.8601 1505.0502 1566.1636 1587.0333 1595.5263 1605.6479 1612.8211 1634.0511 1644.2244 1652.0220 3009.7966 3077.7335 3102.1097 3127.7080 3129.5680 3136.8794 3138.9296 3146.7178 3149.4100 3154.9204 3162.3771 3163.6342 3172.5510 3174.1028 3470.3634 3495.1306
redmass: 5.7803 6.0056 5.4408 5.5858 5.8052 3.9024 1.4251 5.2956 2.9741 3.6761 9.0726 5.8814 5.7928 9.1730 5.3245 4.5397 5.5684 6.7951 8.5924 5.1831 3.4063 4.3263 4.5213 3.0624 3.6702 2.9924 2.0020 7.7968 5.0712 3.7652 3.3753 5.2190 3.2808 4.0852 5.9035 6.2435 6.9572 6.1629 3.1572 2.6534 5.9478 2.3863 2.4998 3.1419 2.9537 1.7583 3.0003 3.6100 5.3211 1.2626 1.2497 6.2136 1.8029 2.6771 1.5552 3.9770 5.3227 1.5244 1.4115 4.0404 3.6605 1.5526 1.3653 2.1908 4.8810 2.3432 2.0559 1.6553 1.5976 1.6216 3.1650 1.0530 1.0537 1.1462 1.7941 1.6383 3.0206 3.3427 1.5607 3.8668 2.6013 1.3266 3.3257 1.6095 1.5572 6.5104 1.2345 9.1647 1.9075 2.3799 2.3421 1.0682 1.0577 2.2543 2.3872 1.7006 9.7848 6.1427 6.6994 6.0385 6.1988 8.9814 9.5423 6.5476 1.0380 1.0834 1.0950 1.0849 1.0849 1.0880 1.0889 1.1021 1.0937 1.0930 1.0961 1.0959 1.1006 1.0997 1.0777 1.0769
irintensity: 0.7600 1.3057 0.2876 2.8116 1.6800 0.1445 2.2225 0.3303 0.9052 2.5886 1.2143 7.7882 5.3019 0.6381 3.8990 0.4694 3.5293 10.6743 2.3369 0.4502 1.1038 16.2985 1.8632 4.3202 21.5670 1.2758 37.2732 6.0384 21.2038 15.6859 8.9308 5.5366 27.7745 4.5792 4.6553 1.2561 7.3722 15.6466 50.8609 47.2907 2.2448 59.1422 25.2168 34.2546 12.1989 119.7543 14.5373 0.7883 20.3400 1.5260 0.7680 16.5472 0.3168 4.8441 4.3649 7.9064 48.7100 9.6576 0.2267 0.7694 0.0474 0.2101 0.3924 28.6595 8.6730 5.0348 12.9958 7.5293 6.5859 2.4670 5.9389 0.6625 0.1627 8.0791 98.7581 47.2307 95.6507 38.1405 19.3332 238.6567 61.8529 90.8659 64.0302 38.8423 21.7018 6.2953 56.1206 3.6674 82.5473 8.6428 12.4499 21.0836 25.3595 9.8280 202.9692 199.1323 713.9945 17.0076 2.7784 141.8159 66.9817 13.7727 129.9151 590.1206 0.4245 2.3398 4.5012 6.4371 2.1646 3.4184 13.1704 4.9617 29.8346 31.5815 20.1810 10.4121 14.7756 6.9336 75.9064 29.0448
temp: 298.150 k
press: 1.00000 atm
elementType: 8 8 8 8 7 7 7 7 6 6 6 6 6 6 6 6 6 6 6 6 6 6 6 6 6 6 1 1 1 1 1 1 1 1 1 1 1 1 1 1 1 1
symmnumber: 1
zpe: 825021.3 jmol-1
zpe.correction: 0.314234 hartree
zpe.thermalcorrener: 0.337458 hartree
zpe.thermalcorrenthalpy: 0.338402 hartree
zpe.thermalcorrgfe: 0.258322 hartree
zpe.sumelectzpe: -1213.552170 hartree
zpe.sumelectthermal: -1213.528946 hartree
zpe.sumelectthermalent: -1213.528001 hartree
zpe.sumelectthermalfe: -1213.608081 hartree
dipole: 1.6531 1.5962 -3.7336
dipole: 4.3841
quadrupole: -142.6098 -139.2768 -152.2159
quadrupole: -12.7574 -3.3951 8.9840
quadrupole: 2.0910 5.4240 -7.5151 -12.7574 -3.3951 8.9840
hfenergy: -1213.8664037 hartree
pointgroup: C01 [X(C18H16N4O4)]
dipole: -0.7520779 -0.6925289 -1.3892053 debye
polarizability: 283.5140966|-14.9084713|271.9918414|-13.4841424|-11.922839|187.5305347 unknown
InChI: InChI=1S/C18H16N4O4/c1-12(23)26-15-16(24)19-18(20-17(15)25)21-22(13-8-4-2-5-9-13)14-10-6-3-7-11-14/h2-11,15,19,21H,1H3
charge 0 multiplicity 1
42 atoms
O  4.263051 0.394843 0.559749
O  3.92169 1.32437 -2.281895
O  2.11531 1.652053 2.220744
O  2.865368 -1.305739 -0.187396
N  -1.648694 0.025766 -0.640299
N  -0.52583 0.329885 -1.415065
N  1.669378 1.053081 -1.793078
N  0.752532 0.977496 0.450932
C  -2.446385 1.129791 -0.183561
C  -1.813362 -1.342718 -0.239471
C  3.249295 1.38542 0.092119
C  0.653298 0.790631 -0.8505
C  3.01086 1.237259 -1.422835
C  1.978651 1.353484 1.006098
C  -3.009758 1.11799 1.118048
C  -3.120555 -1.855743 -0.017514
C  -2.658908 2.247083 -1.030915
C  -0.690643 -2.205441 -0.12901
C  -3.796853 2.204695 1.550441
C  -3.294728 -3.210954 0.328059
C  -3.43422 3.336597 -0.580862
C  -0.884355 -3.563407 0.205003
C  -4.015976 3.320015 0.707654
C  -2.18042 -4.07652 0.438682
C  3.922667 -0.953892 0.385114
C  4.9757 -1.848382 0.986155
H  3.769631 2.341551 0.26769
H  -0.534241 0.00061 -2.385749
H  1.494095 0.977445 -2.800764
H  -2.806466 0.279321 1.790072
H  -3.98896 -1.198309 -0.123814
H  -2.216961 2.262439 -2.032902
H  0.325907 -1.825885 -0.268446
H  -4.219677 2.189999 2.561042
H  -4.307312 -3.594219 0.497055
H  -3.590476 4.196179 -1.242304
H  -0.009979 -4.217435 0.294729
H  -4.620339 4.165135 1.053436
H  -2.321207 -5.13012 0.701681
H  4.868582 -1.848251 2.086105
H  5.984306 -1.472451 0.751608
H  4.849881 -2.87487 0.61306
