program: Gaussian 09
title: 000218414
version: EM64L-G09RevD.01
frameworkgroup: C1[X(C16H21N7O)]
method: RPBEPBE
basis: SDD
operation: Freq
keyword: #p
keyword: freq=noraman
keyword: PBEPBE/SDD
title: #p freq=noraman PBEPBE/SDD
converged: YES YES NO NO
title: Mulliken charges:
elementType: O N N N N N N N C C C C C C C C C C C C C C C C H H H H H H H H H H H H H H H H H H H H H
charge: -0.284491 -0.083746 -0.148650 -0.356084 -0.107128 -0.124957 -0.135575 -0.634335 -0.355011 -0.355164 -0.371754 -0.395770 -0.323418 -0.399335 0.246810 -0.323057 -0.181430 0.184790 -0.347318 -0.221002 -0.019286 -0.202153 -0.292835 0.205877 0.209224 0.185132 0.198863 0.215702 0.197764 0.217818 0.209458 0.273074 0.197996 0.216558 0.244813 0.234777 0.342812 0.214356 0.227621 0.230972 0.226478 0.287419 0.235487 0.320771 0.337927
chargesum: 0.00000
title: Mulliken charges with hydrogens summed into heavy atoms:
elementType: O N N N N N N N C C C C C C C C C C C C C C C C
charge: -0.284491 -0.083746 -0.148650 -0.013272 -0.107128 -0.124957 -0.135575 0.024363 0.039345 0.059402 0.043829 0.086761 0.091137 0.080256 0.246810 -0.108701 0.046191 0.184790 -0.116346 0.005476 -0.019286 0.085266 -0.057348 0.205877
polarizability: 3.78481974e+02 -1.95241343e+01 2.11274157e+02 -1.11920888e+00 -1.48131791e+00 1.31896253e+02
1716.lowfreq: -5.7823 -0.0011 -0.0005 0.0007 1.1658 8.0768 9.8291 14.3801 18.5853
frequency: 8.6739 13.3371 18.2422 30.8983 55.3293 62.0146 73.0243 80.7534 99.8106 135.7273 146.4348 170.0033 214.2831 236.8803 250.1371 275.9145 285.1526 310.2650 321.0755 358.8687 360.5559 392.7752 404.4291 408.9146 410.2011 417.3579 468.2338 473.0610 487.3703 495.1536 509.1712 560.4380 572.5260 608.9670 615.8873 627.2558 648.6344 693.4619 725.2686 726.0803 729.1374 752.8060 767.2386 774.2393 780.9400 819.5373 835.5087 841.5421 844.6087 850.0442 927.7338 941.7276 943.3459 952.5438 975.2175 976.5645 994.1827 998.4314 1000.2910 1014.4432 1041.7314 1047.6632 1053.6773 1058.7321 1077.6171 1094.2759 1103.9368 1116.0463 1143.1639 1153.3970 1165.5333 1170.4350 1188.1647 1193.6498 1202.5506 1234.0905 1253.3685 1267.0293 1271.2776 1294.6742 1296.1449 1302.0513 1304.5886 1325.7522 1330.5595 1339.1290 1353.7984 1363.9095 1370.2527 1376.9697 1390.6186 1392.8890 1416.2821 1425.1246 1449.7865 1454.7834 1457.1936 1463.3581 1468.7602 1478.7490 1486.7300 1505.8444 1542.3826 1551.3239 1582.0166 1598.4009 1607.8530 1621.9033 2854.9661 2872.5964 2894.8154 2946.1956 2953.5429 3020.0357 3021.2695 3030.8405 3055.6814 3088.1270 3090.1603 3097.8084 3117.3401 3133.8272 3142.5876 3165.0935 3176.2970 3177.0624 3469.3797 3545.0587 3699.7851
redmass: 5.6784 6.3603 4.1292 5.3353 3.3341 3.5572 5.5799 7.2252 5.8971 3.8055 3.9770 3.0219 4.3064 3.7412 2.0332 4.2359 3.5654 3.5223 3.6940 3.6841 2.9845 4.0429 1.2164 2.3822 3.1179 4.5538 3.6340 2.8916 1.7713 5.0673 2.7781 4.8229 1.7940 4.0165 5.8810 2.7619 7.1044 5.3127 1.1313 1.6790 4.5129 1.6228 2.5720 3.6629 7.0007 4.3509 2.3829 1.6701 1.4310 1.6371 4.1197 1.5136 2.2082 4.2928 1.3210 5.2691 1.3358 1.6890 2.6142 3.7624 2.6136 2.1376 2.2594 2.2798 2.0879 1.6690 2.4144 1.2614 2.5793 2.7517 2.7868 1.1293 5.2833 2.1313 1.1413 1.5894 1.4814 2.1342 1.3868 1.6985 1.7105 1.8803 1.2365 1.3385 1.7146 1.7863 1.4411 1.3282 2.4987 1.4577 1.7766 1.5874 5.9478 2.1669 1.0947 1.1226 1.0901 1.1083 1.1635 1.0996 2.6792 2.1382 4.2913 5.2240 3.3985 6.0614 8.1380 1.5531 1.0704 1.0706 1.0685 1.0694 1.0695 1.0873 1.0632 1.0893 1.0895 1.0908 1.1043 1.0919 1.0893 1.0885 1.0910 1.0923 1.0999 1.0973 1.0778 1.0452 1.1042
irintensity: 0.3080 0.4530 0.5346 1.0757 0.0686 0.6509 7.1380 10.9896 0.5331 3.4211 7.3436 1.0334 7.0634 8.8009 2.4902 9.6784 0.9327 3.8119 16.7968 15.0409 6.3962 10.9956 107.3970 16.3671 12.3340 10.4794 5.5728 4.5480 85.1699 0.7909 8.4933 13.9792 84.2675 7.6707 1.7841 3.4094 0.3930 3.4592 105.8972 39.5489 0.7259 5.1546 64.0491 4.3563 15.3007 4.7259 0.5671 1.0241 0.0553 34.9694 10.2921 2.8974 9.3214 52.1260 0.2384 20.2459 0.2663 0.7235 73.9559 1.7929 10.7940 5.7470 0.3484 10.4292 5.6515 0.4157 5.7734 43.6023 83.1115 31.4382 72.9392 2.2634 37.2029 24.9148 9.6711 52.6814 135.2869 17.7433 38.0954 20.0500 12.6119 21.9018 14.6965 8.2828 12.6589 25.4305 17.2021 15.2764 1.3715 18.8318 1.0146 1.7619 119.5234 31.1841 13.0984 75.3005 8.9643 50.3007 51.9442 7.9671 207.7770 428.4313 4.7241 45.7226 60.0102 388.3294 167.0426 367.7192 66.9947 53.2570 93.5417 48.8378 93.0388 14.5187 38.9081 62.4113 41.6182 24.4253 15.5866 10.8464 31.2679 12.8364 14.1156 35.5255 15.6230 3.9512 57.9256 132.2746 42.4884
temp: 298.150 k
press: 1.00000 atm
elementType: 8 7 7 7 7 7 7 7 6 6 6 6 6 6 6 6 6 6 6 6 6 6 6 6 1 1 1 1 1 1 1 1 1 1 1 1 1 1 1 1 1 1 1 1 1
symmnumber: 1
zpe: 959484.6 jmol-1
zpe.correction: 0.365448 hartree
zpe.thermalcorrener: 0.387446 hartree
zpe.thermalcorrenthalpy: 0.388391 hartree
zpe.thermalcorrgfe: 0.309655 hartree
zpe.sumelectzpe: -1078.990088 hartree
zpe.sumelectthermal: -1078.968090 hartree
zpe.sumelectthermalent: -1078.967146 hartree
zpe.sumelectthermalfe: -1079.045882 hartree
dipole: 5.2333 -2.1711 -1.9530
dipole: 5.9929
quadrupole: -75.7091 -140.1933 -143.7879
quadrupole: 17.1019 -9.4243 -0.3861
quadrupole: 44.1876 -20.2965 -23.8912 17.1019 -9.4243 -0.3861
hfenergy: -1079.3555367 hartree
pointgroup: C01 [X(C16H21N7O1)]
dipole: -2.0673708 1.0629802 -0.3940773 debye
polarizability: 378.917941|-16.8015962|198.1144545|-5.2516245|29.0554871|144.6199888 unknown
InChI: InChI=1S/C16H21N7O/c17-14-5-4-13(20-21-14)16(24)19-7-8-22-9-11-23(12-10-22)15-3-1-2-6-18-15/h1-6,19H,7-12,17H2
charge 0 multiplicity 1
45 atoms
O  -2.754349 -1.873841 -0.492429
N  1.117349 0.530423 0.647667
N  3.96669 0.202999 0.355306
N  -2.643428 0.020489 0.887728
N  5.652665 -1.240794 -0.428942
N  -5.228418 0.606529 0.436073
N  -6.52714 0.980263 0.27885
N  -8.649817 0.656039 -0.61888
C  1.977031 1.680309 0.284085
C  1.680964 -0.721226 0.074746
C  3.408467 1.480211 0.82674
C  3.098446 -0.96612 0.615631
C  -0.31098 0.733137 0.313703
C  -1.225325 -0.125469 1.226533
C  5.286328 0.03713 -0.065728
C  6.228373 1.118303 -0.135252
C  7.52724 0.859869 -0.605794
C  -3.294761 -0.85449 0.04999
C  6.917134 -1.45916 -0.877094
C  7.898322 -0.451772 -0.994924
C  -4.74483 -0.517405 -0.181267
C  -5.556614 -1.340588 -1.006153
C  -6.893521 -0.981846 -1.185279
C  -7.3558 0.19905 -0.520803
H  1.552777 2.600063 0.728377
H  2.032881 1.824718 -0.825442
H  1.713664 -0.67083 -1.042582
H  1.038132 -1.574385 0.353289
H  4.030889 2.32254 0.486725
H  3.374598 1.4969 1.937795
H  3.038089 -1.144955 1.710672
H  3.56543 -1.840949 0.138874
H  -0.557713 1.801542 0.465797
H  -0.538929 0.490583 -0.752362
H  -0.970323 -1.193378 1.116055
H  -1.059397 0.164698 2.278972
H  -3.207712 0.801856 1.243199
H  5.964511 2.130839 0.179773
H  8.252143 1.68001 -0.661201
H  7.143775 -2.497257 -1.150411
H  8.901606 -0.683917 -1.362243
H  -5.107847 -2.223213 -1.470081
H  -7.568827 -1.576488 -1.809112
H  -9.352151 0.172813 -1.170918
H  -8.893922 1.505667 -0.112382
