program: Gaussian 09
title: 000218413
version: EM64L-G09RevD.01
frameworkgroup: C1[X(C18H24N6O2)]
method: RPBEPBE
basis: SDD
operation: Freq
keyword: #p
keyword: freq=noraman
keyword: PBEPBE/SDD
title: #p freq=noraman PBEPBE/SDD
converged: YES YES NO NO
title: Mulliken charges:
elementType: O O N N N N N N C C C C C C C C C C C C C C C C C C H H H H H H H H H H H H H H H H H H H H H H H H
charge: -0.265352 -0.299325 -0.084819 -0.153856 -0.385552 -0.131576 -0.050459 -0.626729 -0.355870 -0.367774 -0.376662 -0.384345 -0.321740 -0.403851 0.259382 -0.361472 -0.147576 0.118183 0.174191 -0.358326 0.249459 -0.243664 -0.458716 -0.513441 -0.319938 0.158656 0.223690 0.195002 0.189527 0.206807 0.204841 0.218710 0.207496 0.260238 0.195261 0.223515 0.250661 0.231552 0.299609 0.216961 0.227954 0.249221 0.282383 0.214853 0.224306 0.227235 0.227836 0.227685 0.330088 0.315740
chargesum: 0.00000
title: Mulliken charges with hydrogens summed into heavy atoms:
elementType: O O N N N N N N C C C C C C C C C C C C C C C C C C
charge: -0.265352 -0.299325 -0.084819 -0.153856 -0.085944 -0.131576 -0.050459 0.019099 0.062823 0.028559 0.046890 0.083389 0.097036 0.078363 0.259382 -0.144511 0.080378 0.118183 0.174191 -0.109105 0.249459 0.038720 -0.243863 0.169315 -0.095632 0.158656
polarizability: 4.01222997e+02 -1.09046430e+01 2.35516387e+02 -4.60356312e+00 -1.12468637e+01 1.53808682e+02
1716.lowfreq: -15.9867 -2.5588 0.0007 0.0009 0.0014 2.8595 5.2852 9.3480 13.1757
frequency: -15.2829 9.1747 13.1128 25.4225 28.4785 43.4604 55.2321 75.3712 100.4508 105.4193 117.6676 144.4875 166.0724 170.3287 200.3129 212.0119 231.4473 246.0901 261.3877 281.7449 292.3603 305.3671 320.9812 364.0307 372.7552 400.1614 404.8869 407.7835 408.0565 443.6155 456.0881 464.0129 473.3868 476.0226 489.5646 507.7571 551.2372 560.6529 595.4254 612.1126 625.0410 636.5806 652.6772 679.0347 701.9133 711.3726 740.2713 771.4244 773.8615 775.9937 823.0671 829.7367 834.5635 840.5141 844.4489 847.0711 906.6775 938.3550 939.5756 959.9324 961.7923 976.3348 996.0731 999.1638 1008.3164 1009.2807 1016.0178 1045.7231 1052.6876 1066.4276 1076.9736 1077.9366 1102.5737 1113.0320 1136.8970 1142.5260 1147.4454 1149.6352 1158.0664 1173.6577 1191.3872 1202.4217 1226.6986 1247.7874 1266.9323 1274.2527 1279.0745 1299.1065 1306.0966 1316.3791 1322.4983 1330.2086 1340.3329 1343.3592 1354.8342 1357.1967 1361.5988 1376.2797 1383.9385 1391.1749 1391.8703 1396.4071 1443.1168 1443.9892 1449.8076 1453.9923 1455.9652 1458.4386 1466.8388 1467.5841 1477.4413 1478.0856 1483.0144 1510.6570 1541.8766 1568.9024 1588.4351 1591.2422 1601.6226 1624.5993 2861.3953 2868.3255 2902.7456 2944.2058 2947.7683 2988.5110 3019.9461 3025.4661 3033.1492 3055.7730 3083.9794 3087.7703 3094.7140 3094.9518 3096.6236 3128.5040 3140.1227 3140.3689 3166.4064 3180.6955 3194.5896 3551.1358 3571.3202 3706.1155
redmass: 4.1185 5.8208 5.1381 5.6461 5.4428 3.1116 4.2663 5.1981 4.8493 3.5936 3.9457 3.2727 1.2498 3.1873 2.6454 3.8988 3.3568 3.3296 2.3900 3.7471 2.9372 5.0675 3.4721 2.8126 3.9661 1.8733 1.7153 3.8556 2.0808 4.5408 3.7011 3.5025 2.6063 1.9442 4.2154 1.2157 1.6850 5.1224 5.0107 2.7771 4.1333 6.7618 4.8346 4.4908 5.2660 1.5980 1.6544 2.9235 4.3623 4.4382 2.5384 1.4742 3.3685 1.8439 1.5938 3.9054 1.5227 4.9197 2.6103 4.5721 1.3120 4.1399 2.8675 1.3368 1.9830 2.8013 2.8318 1.9884 2.8402 1.8918 1.8100 2.0051 2.4145 1.2542 1.2378 2.4150 2.3195 1.4993 2.6724 1.2387 1.6428 1.2607 1.6317 2.1556 1.8692 1.6708 1.6732 1.3731 1.1711 1.5886 1.4581 1.4465 2.4358 2.6073 3.4404 1.7835 1.3599 1.3627 2.2838 1.4391 3.1372 2.0806 1.1310 1.5697 1.0544 1.1469 1.0894 1.1822 1.1333 1.0944 1.7061 1.2489 2.4149 2.5898 4.3045 5.7978 6.5774 6.7762 2.2601 2.0552 1.0711 1.0698 1.0681 1.0694 1.0697 1.0297 1.0888 1.0631 1.0897 1.0892 1.1038 1.0909 1.0939 1.1005 1.0913 1.1037 1.0891 1.0894 1.0969 1.0926 1.0970 1.0449 1.0774 1.1046
irintensity: 7.5408 0.0306 0.3529 5.4537 1.0700 1.8563 0.6769 1.2766 1.6139 4.1971 1.3687 0.6056 0.2984 12.5917 1.5620 4.8812 4.2634 4.5566 6.6177 2.4354 17.7154 3.9280 12.5786 3.0937 13.8230 94.2219 66.7296 9.7929 17.7346 6.4510 0.6573 10.5876 7.1173 5.6735 6.7077 239.0957 3.5727 10.0169 0.7688 11.1819 0.4930 3.2751 1.2766 1.5113 11.6890 31.5966 3.2546 75.4847 11.8550 8.6200 4.6894 2.1633 0.5783 0.7380 37.9369 2.5078 7.6171 0.3122 3.1727 60.1028 0.6729 1.4196 125.8801 0.9854 3.7527 17.4251 9.9903 1.8136 11.0814 23.9627 4.2542 1.2969 3.7979 0.4080 72.1467 62.8968 31.3879 13.0903 86.1563 2.9304 1.5604 12.8948 209.9257 37.8490 131.3986 91.7097 118.8659 28.2344 40.5609 27.0595 16.4696 11.6886 1.2624 39.2584 36.8456 2.0549 23.8113 47.4691 24.8054 21.1396 64.6109 64.2814 32.3452 20.9242 17.2633 133.1199 5.9847 168.3287 15.7608 61.8498 222.4247 145.3138 152.1022 76.6591 5.1220 162.8379 145.4670 547.3862 29.2864 574.5534 42.8008 78.1164 83.0692 24.0134 120.9868 49.8577 14.1500 40.5258 60.9246 38.1771 37.8703 19.2788 26.0889 29.6704 7.8694 36.7216 17.4460 11.3320 8.4675 17.0475 3.8092 136.9663 10.1857 37.4222
temp: 298.150 k
press: 1.00000 atm
elementType: 8 8 7 7 7 7 7 7 6 6 6 6 6 6 6 6 6 6 6 6 6 6 6 6 6 6 1 1 1 1 1 1 1 1 1 1 1 1 1 1 1 1 1 1 1 1 1 1 1 1
symmnumber: 1
zpe: 1074166.6 jmol-1
zpe.correction: 0.409128 hartree
zpe.thermalcorrener: 0.433247 hartree
zpe.thermalcorrenthalpy: 0.434191 hartree
zpe.thermalcorrgfe: 0.351470 hartree
zpe.sumelectzpe: -1177.338976 hartree
zpe.sumelectthermal: -1177.314858 hartree
zpe.sumelectthermalent: -1177.313913 hartree
zpe.sumelectthermalfe: -1177.396635 hartree
dipole: 5.6324 -1.8379 -0.2057
dipole: 5.9282
quadrupole: -127.7451 -142.7072 -154.7793
quadrupole: 0.9109 -15.9138 -2.7775
quadrupole: 13.9988 -0.9634 -13.0354 0.9109 -15.9138 -2.7775
hfenergy: -1177.7481048 hartree
pointgroup: C01 [X(C18H24N6O2)]
dipole: -2.2222666 -0.402191 0.5827309 debye
polarizability: 401.3042524|1.146763|203.1461863|-11.6942194|-41.3292999|186.0976278 unknown
InChI: InChI=1S/C18H24N6O2/c1-26-17-4-2-3-16(22-17)24-11-9-23(10-12-24)8-7-20-18(25)14-5-6-15(19)21-13-14/h2-6,13,20H,7-12,19H2,1H3
charge 0 multiplicity 1
50 atoms
O  7.584832 -0.120246 1.518381
O  -3.292604 1.115199 -1.222567
N  0.572113 -0.820769 -0.111148
N  3.340912 -0.144622 -0.535713
N  -3.218351 -1.027834 -0.337701
N  5.481298 -0.112173 0.442381
N  -7.352992 -0.599696 0.869957
N  -9.287961 0.690485 1.051198
C  0.947023 0.385819 -0.888926
C  1.578957 -1.065482 0.952103
C  2.329572 0.205279 -1.547541
C  2.965875 -1.285384 0.323952
C  -0.823832 -0.773318 0.38086
C  -1.813266 -1.221581 -0.726054
C  4.647912 0.345658 -0.554109
C  5.123562 1.278791 -1.527381
C  6.454296 1.738155 -1.425702
C  6.747375 0.346556 0.50518
C  -3.879864 0.161574 -0.610213
C  7.305789 1.284728 -0.398099
C  -5.307704 0.280576 -0.167092
C  -5.977374 1.514278 -0.411552
C  -6.059831 -0.735265 0.47592
C  7.008119 -1.095318 2.459434
C  -7.308568 1.687914 -0.01991
C  -7.976438 0.600799 0.628442
H  0.194022 0.567272 -1.675747
H  0.975195 1.292234 -0.232582
H  1.634285 -0.211989 1.674402
H  1.290894 -1.973584 1.513694
H  2.600487 1.148509 -2.046685
H  2.261869 -0.591899 -2.319369
H  2.934421 -2.215168 -0.284842
H  3.74149 -1.394035 1.09685
H  -0.91312 -1.455751 1.247853
H  -1.117832 0.244998 0.729476
H  -1.641447 -0.624943 -1.637263
H  -1.638017 -2.284305 -0.969033
H  -3.687135 -1.768251 0.183027
H  4.494077 1.629063 -2.347126
H  6.830958 2.453561 -2.165148
H  8.340485 1.613499 -0.289296
H  -5.416617 2.309761 -0.912859
H  -5.632959 -1.72336 0.695537
H  -7.832008 2.632096 -0.203043
H  7.825404 -1.313574 3.163261
H  6.137533 -0.666272 2.98606
H  6.688197 -2.010747 1.931051
H  -9.700929 -0.122608 1.503359
H  -9.8386 1.532967 0.915423
