program: Gaussian 09
title: 000218371
version: EM64L-G09RevD.01
frameworkgroup: C1[X(C20H19N5O4)]
method: RPBEPBE
basis: SDD
operation: Freq
keyword: #p
keyword: freq=noraman
keyword: PBEPBE/SDD
title: #p freq=noraman PBEPBE/SDD
converged: YES YES NO NO
title: Mulliken charges:
elementType: O O O O N N N N N C C C C C C C C C C C C C C C C C C C C H H H H H H H H H H H H H H H H H H H
charge: -0.335670 -0.241668 -0.208188 -0.229991 -0.133038 -0.253510 -0.429254 -0.504274 -0.636378 0.356037 0.040364 0.122814 0.463075 -0.643692 -0.748548 -0.356885 -0.382168 0.060981 0.094131 0.331127 -0.209300 -0.206033 -0.243799 -0.347413 -0.326218 -0.247380 -0.227423 0.127806 0.086701 0.271639 0.251783 0.251202 0.265092 0.223300 0.276247 0.350938 0.268837 0.262930 0.234499 0.233748 0.236558 0.267934 0.294285 0.236026 0.236287 0.346049 0.394610 0.325832
chargesum: 0.00000
title: Mulliken charges with hydrogens summed into heavy atoms:
elementType: O O O O N N N N N C C C C C C C C C C C C C C C C C C C C
charge: -0.335670 -0.241668 -0.208188 -0.229991 -0.133038 -0.253510 -0.078317 -0.158225 0.084063 0.356037 0.040364 0.122814 0.463075 0.130933 0.016091 -0.088048 -0.119238 0.060981 0.094131 0.331127 0.025199 0.027715 -0.007241 -0.079479 -0.031933 -0.011354 0.008864 0.127806 0.086701
polarizability: 3.92410855e+02 2.21852021e+01 3.14203019e+02 6.99730128e+00 2.41744988e+00 1.46892895e+02
1716.lowfreq: -6.3224 -4.1225 -0.0008 -0.0003 0.0004 2.1444 7.5497 24.0456 32.7616
frequency: 5.1452 24.0017 32.7180 43.5572 56.9146 59.7745 68.1049 75.2192 78.5998 97.1248 110.4057 117.6122 136.5493 149.1096 157.1809 167.7085 175.0094 192.5702 213.3667 240.1013 257.5723 270.8439 275.0100 285.9301 305.3608 329.8115 353.5637 377.4540 381.4022 385.0129 407.3699 426.8247 436.4651 472.6663 499.4215 516.6746 535.2531 546.2455 576.2293 588.4442 612.7688 614.5383 622.9999 634.0567 646.1829 654.4216 680.4477 693.1309 695.8074 709.3156 716.9785 746.7408 754.1495 765.3117 769.2590 780.1531 813.6181 830.4854 842.9286 857.6421 872.9594 880.8573 894.5917 912.9499 922.0307 967.6570 973.2782 987.8476 995.1626 995.5494 1011.8709 1035.1399 1039.6949 1044.1904 1057.9817 1063.9641 1070.2759 1084.4455 1103.3047 1113.9456 1127.9158 1141.9030 1174.6219 1175.6235 1180.6131 1186.5955 1206.4758 1236.9534 1255.0409 1292.5499 1302.7366 1317.5868 1339.1264 1347.6226 1370.0927 1384.1085 1389.1225 1410.0551 1428.2314 1435.3140 1445.1708 1452.3302 1454.8249 1459.2082 1470.6755 1484.7239 1488.3953 1491.5083 1502.3417 1576.9952 1589.9397 1594.7243 1600.1923 1606.6145 1613.9808 1616.8423 1632.1503 1640.1413 1662.0452 2983.6459 2996.0049 3075.6427 3092.3723 3129.0031 3132.1007 3133.8456 3139.3633 3143.5143 3153.2144 3155.1835 3168.8449 3170.3231 3186.8085 3198.7887 3262.3822 3474.2982 3494.1086 3573.3394
redmass: 5.7222 6.2065 5.7155 3.9434 7.3268 5.3767 2.8387 4.4686 4.9175 1.8875 4.5988 4.2213 4.1187 1.5512 2.0254 5.3267 5.0725 5.7541 5.7446 4.9577 4.4913 5.3258 4.9024 4.2682 5.7619 4.4011 7.3627 5.2958 5.4565 5.6222 2.9167 5.2807 4.6383 4.3297 3.3944 4.1907 1.9418 1.9870 4.9213 4.7673 4.2530 4.4856 6.3875 4.0649 3.4077 4.6865 4.2548 2.5785 2.3177 6.6190 3.8032 1.2082 3.0675 2.0134 4.4185 1.6342 5.4113 5.2236 1.2656 1.4811 2.4218 2.3822 2.5469 1.9458 1.7655 1.3914 1.3734 5.5258 1.3496 1.3426 3.4978 1.8573 2.2851 1.7561 2.1943 1.9949 3.2140 1.8091 1.7552 2.0671 2.5480 2.1144 1.1057 1.4989 1.3159 1.3762 3.5865 1.9479 2.9664 1.7874 3.7085 1.5040 3.6065 3.8883 7.9051 5.2260 3.2868 1.3568 2.2208 1.2270 2.0617 1.2730 1.6437 1.1301 1.1179 2.3638 2.2115 1.2345 1.9408 5.5630 7.0059 6.4044 7.3383 3.6790 6.0953 5.9890 6.6826 8.0790 1.5095 1.0415 1.0393 1.0984 1.0927 1.0974 1.0997 1.0860 1.0864 1.0890 1.0915 1.0945 1.0989 1.0988 1.0971 1.0951 1.0687 1.0766 1.0767 1.0863
irintensity: 1.1419 4.5407 2.6096 8.6081 1.1888 3.6088 0.9233 3.2303 2.6661 1.6350 1.2566 3.5988 24.5176 1.4639 0.1434 3.3300 2.4669 0.2021 1.0777 0.2845 1.5920 2.7518 2.9398 21.2042 7.7318 14.7606 18.3737 4.7219 2.0587 2.4144 0.6888 10.6468 5.1477 2.8293 15.1652 7.0769 122.6542 49.4610 17.6321 25.8712 8.8513 2.9133 21.5458 15.9733 30.8691 13.4431 30.4208 25.3239 7.1564 7.7774 37.3876 72.8604 27.1028 96.4753 9.2076 47.4028 1.4842 2.5427 6.5207 139.7328 41.5917 8.0672 20.8735 5.4779 5.6762 2.3359 0.4247 0.0740 0.2429 1.0250 20.7728 0.8949 9.2914 0.6522 14.2067 19.5875 0.3837 12.2443 10.8854 16.4958 94.1365 13.5632 5.6229 26.8463 6.3941 5.1673 8.7736 28.5418 162.4813 136.4702 104.0758 60.5669 98.1893 79.3986 57.6892 58.1606 103.3023 47.0950 115.7783 23.5661 23.6877 21.5584 24.1685 14.5927 100.5041 141.6834 102.3428 77.2870 203.0895 30.0092 272.1289 197.1626 228.8445 38.0041 156.3945 59.9403 130.6274 16.8500 263.4101 57.2483 17.7774 14.4496 12.0840 9.6894 5.3320 2.0028 2.7613 5.6316 8.9146 19.6432 24.3583 22.4322 2.2500 2.8247 937.3210 31.7130 27.4662 60.0893
temp: 298.150 k
press: 1.00000 atm
elementType: 8 8 8 8 7 7 7 7 7 6 6 6 6 6 6 6 6 6 6 6 6 6 6 6 6 6 6 6 6 1 1 1 1 1 1 1 1 1 1 1 1 1 1 1 1 1 1 1
symmnumber: 1
zpe: 960869.5 jmol-1
zpe.correction: 0.365976 hartree
zpe.thermalcorrener: 0.392760 hartree
zpe.thermalcorrenthalpy: 0.393704 hartree
zpe.thermalcorrgfe: 0.305701 hartree
zpe.sumelectzpe: -1346.153415 hartree
zpe.sumelectthermal: -1346.126631 hartree
zpe.sumelectthermalent: -1346.125687 hartree
zpe.sumelectthermalfe: -1346.213690 hartree
dipole: 8.6720 -7.7590 0.2309
dipole: 11.6387
quadrupole: -141.1487 -182.3903 -173.8223
quadrupole: 18.1968 3.5537 7.5139
quadrupole: 24.6384 -16.6032 -8.0352 18.1968 3.5537 7.5139
hfenergy: -1346.5193906 hartree
pointgroup: C01 [X(C20H19N5O4)]
dipole: 3.722857 -2.6570702 -0.2183499 debye
polarizability: 386.8883732|29.7611823|317.9444308|5.2963927|18.4192323|148.673965 unknown
InChI: InChI=1S/C20H19N5O4/c1-12-16(20(29)25(24(12)2)13-8-4-3-5-9-13)23-18(27)14-10-6-7-11-15(14)22-19(28)17(21)26/h3-11,22-23H,21H2,1-2H3
charge 0 multiplicity 1
48 atoms
O  0.936025 1.333725 -0.081219
O  -1.250876 -3.008957 0.848951
O  -3.979221 2.463151 -0.969093
O  -3.094142 4.044064 1.382395
N  2.897845 -1.628846 -0.166952
N  2.766936 -0.214195 -0.010351
N  -0.720252 -1.101377 -0.39244
N  -2.905501 0.760359 0.260824
N  -1.07597 2.942255 0.978334
C  1.599091 -2.166383 -0.275904
C  0.681167 -1.120318 -0.238084
C  1.395583 0.140188 -0.0851
C  3.886079 0.661467 -0.185897
C  3.953105 -2.297608 0.629388
C  1.401988 -3.645318 -0.422306
C  3.912956 1.884741 0.527103
C  4.93399 0.325779 -1.080356
C  -1.628557 -1.987024 0.198205
C  -3.081806 -1.694428 -0.082882
C  -3.663927 -0.388969 -0.148789
C  4.996214 2.769283 0.341941
C  6.02177 1.210686 -1.238572
C  6.057731 2.434558 -0.53083
C  -3.90237 -2.828525 -0.314518
C  -5.022148 -0.249314 -0.537131
C  -5.253729 -2.687436 -0.680935
C  -5.801929 -1.389884 -0.811629
C  -3.165942 2.100161 -0.080998
C  -2.430751 3.125133 0.821871
H  4.929434 -1.834099 0.423903
H  3.994134 -3.354143 0.324641
H  3.741727 -2.237073 1.714308
H  1.398408 -4.15757 0.557009
H  2.188782 -4.088877 -1.058304
H  0.42043 -3.844906 -0.874579
H  -1.100901 -0.281076 -0.877758
H  3.089612 2.136243 1.199716
H  4.876123 -0.598852 -1.664538
H  5.013327 3.718914 0.887107
H  6.831359 0.951237 -1.929254
H  6.899324 3.122355 -0.663742
H  -3.444929 -3.817283 -0.207944
H  -5.455959 0.748745 -0.614305
H  -5.869173 -3.572751 -0.869616
H  -6.848573 -1.261075 -1.107615
H  -2.211384 0.617055 1.00205
H  -0.48059 2.287029 0.437855
H  -0.59561 3.618859 1.575541
