program: Gaussian 09
title: 000218367
version: EM64L-G09RevD.01
frameworkgroup: C1[X(C24H27N3O)]
method: RPBEPBE
basis: SDD
operation: Freq
keyword: #p
keyword: freq=noraman
keyword: PBEPBE/SDD
title: #p freq=noraman PBEPBE/SDD
converged: YES YES NO NO
title: Mulliken charges:
elementType: O N N N C C C C C C C C C C C C C C C C C C C C C C C C H H H H H H H H H H H H H H H H H H H H H H H H H H H
charge: -0.261880 -0.211623 -0.190111 0.003964 0.266801 0.126022 -0.437822 -0.360582 -0.511393 -0.407434 -0.404932 -0.465610 -0.114513 -0.487144 0.279897 -0.106147 0.289609 -0.518944 -0.318883 0.302179 -0.348250 0.294735 -0.354734 -0.372107 -0.830255 -0.252907 -0.251864 -0.537567 0.224199 0.245956 0.217238 0.198389 0.221957 0.226446 0.179852 0.235540 0.225070 0.215135 0.219371 0.227139 0.240453 0.228237 0.265631 0.264139 0.238579 0.253696 0.227440 0.244125 0.221864 0.228769 0.222457 0.225905 0.221711 0.216130 0.246063
chargesum: 0.00000
title: Mulliken charges with hydrogens summed into heavy atoms:
elementType: O N N N C C C C C C C C C C C C C C C C C C C C C C C C
charge: -0.261880 -0.211623 -0.190111 0.003964 0.266801 0.126022 0.032334 0.055046 -0.062990 0.007958 0.035273 -0.019100 -0.114513 -0.018454 0.279897 -0.106147 0.289609 -0.253313 -0.054743 0.302179 -0.109671 0.294735 -0.101037 -0.144667 -0.135498 -0.030450 -0.025958 0.146337
polarizability: 3.86993160e+02 1.21021409e+01 3.60146793e+02 -1.01379386e+00 6.43061932e+00 1.52414897e+02
1716.lowfreq: -4.8394 -0.0007 -0.0003 0.0004 2.5281 4.3400 18.6757 32.6342 38.0520
frequency: 18.4202 32.6270 38.0385 58.5495 71.6175 85.7591 93.0966 105.3985 132.1941 148.7617 152.0342 158.9360 175.6476 191.9733 210.8197 216.7174 239.8049 258.6410 268.8736 273.2383 291.6752 308.0688 319.2590 338.2204 364.6707 375.0965 397.2802 404.6108 443.4203 451.0523 459.7021 468.1550 477.1839 484.1103 535.7622 549.5720 552.7041 577.4760 590.2314 603.3367 625.8943 634.2775 653.7707 687.3835 700.8102 714.3458 724.0293 751.6010 761.2836 785.7693 789.9054 810.6144 834.5478 841.1576 850.4467 855.3080 866.1549 872.9961 884.8282 916.6293 918.5397 932.1515 946.2541 963.6417 975.0440 975.8603 980.2404 997.7990 1010.7844 1027.5538 1037.6531 1042.7877 1044.5705 1049.4129 1053.6107 1073.6056 1090.2249 1106.5141 1113.2836 1115.8882 1127.0025 1145.8336 1150.6911 1161.4605 1173.9203 1181.7845 1184.1518 1199.5418 1201.9606 1209.2429 1211.6972 1227.7880 1242.7816 1262.0366 1263.2807 1271.9409 1279.7987 1290.0727 1291.6741 1312.9099 1333.9421 1338.1065 1342.9797 1353.7529 1363.6838 1366.1712 1377.3562 1379.5379 1390.4819 1404.2931 1424.4113 1424.5785 1432.8245 1450.7584 1452.3834 1456.5636 1457.7186 1459.9246 1462.8618 1464.9660 1467.0527 1467.5283 1471.6663 1477.9933 1487.1640 1491.5614 1504.7856 1559.3184 1580.8585 1582.0878 1609.2414 1622.3424 2857.8831 2900.8977 2915.7405 2920.4505 2952.3948 2962.9680 2967.4005 2981.3785 3005.3507 3037.8814 3041.4854 3042.6198 3051.4006 3067.1296 3067.9151 3071.9377 3080.2961 3081.0679 3087.6031 3115.2583 3123.4572 3126.7810 3145.8716 3153.3402 3161.6313 3166.5985 3175.4532
redmass: 4.9024 3.7781 4.0593 4.2658 4.5311 3.2740 3.2560 3.7325 2.9753 2.9599 4.0618 3.2165 3.0774 1.0386 1.9727 2.7028 2.8856 1.9659 3.2111 3.7773 2.7803 2.5717 2.7930 3.3670 5.1047 3.2723 5.1666 2.4629 4.5058 2.8009 3.3945 3.0793 3.5029 4.0808 5.1918 3.7429 4.3923 3.2768 4.8628 3.3932 3.9404 2.6653 3.5232 4.9736 3.4765 6.0847 2.3228 4.8457 1.5675 2.9211 4.6449 4.5614 2.2125 1.7043 1.4874 1.4467 4.1926 1.5199 1.6046 3.5991 2.5449 1.4238 3.1977 2.4936 1.3238 1.3329 1.5534 3.9984 2.4440 2.2310 1.6692 1.6811 2.0755 1.7783 2.0983 3.0353 2.4849 1.6354 1.2641 1.8653 1.3073 1.9886 2.5329 1.6511 1.0875 1.5859 1.7315 1.5210 1.9991 2.1453 1.4860 1.6614 3.2953 1.6559 1.4198 1.8026 1.4128 1.5367 1.4856 1.4730 1.3461 1.9059 1.9773 2.2855 1.7444 2.0644 2.5042 2.2013 1.2616 5.6790 1.6119 4.3147 2.0373 1.4334 1.3370 1.0985 1.1097 1.1747 1.0807 1.0650 1.1654 1.0982 1.0860 1.1150 1.2028 2.0890 3.6881 8.8404 10.2864 6.5516 6.0493 6.6787 1.0699 1.0714 1.0707 1.0685 1.0334 1.0402 1.0657 1.0673 1.0641 1.1034 1.0937 1.0924 1.0896 1.0937 1.0949 1.0911 1.1025 1.0986 1.0896 1.0869 1.0989 1.0878 1.0928 1.0875 1.1004 1.0891 1.0980
irintensity: 0.3645 0.4443 2.0296 0.6218 0.1766 0.0261 0.3746 0.1799 2.1765 2.3930 0.0751 1.6141 0.2830 0.4971 7.6827 5.9956 4.1039 0.7141 5.7819 1.2002 5.9531 2.4758 6.2205 2.2101 1.7526 1.9029 0.4685 2.1623 6.4812 6.8196 3.4853 0.6675 3.7127 2.5847 0.2196 2.4063 5.1797 8.1268 3.2809 4.3418 0.8624 5.2236 9.3537 4.8670 5.7747 5.3981 16.6361 14.0318 67.7029 1.9610 0.6236 0.3293 5.1537 51.9645 0.6449 0.4685 0.2880 22.3207 1.1763 6.7135 17.2664 2.2102 34.8422 18.4244 0.4015 0.3728 6.8864 30.4913 110.0354 0.7646 0.5227 9.5937 27.8802 2.9369 7.1440 5.6043 3.1517 20.8876 0.2862 18.6228 3.8426 8.1363 31.1543 11.8329 0.1605 3.4048 13.7644 119.4589 28.8643 78.7063 1.7726 105.9866 43.5204 3.5701 23.4490 29.1660 13.9420 2.7581 11.3164 0.6842 4.2478 34.6596 4.5704 6.3102 49.2271 10.5663 23.0581 40.2403 15.5211 22.1847 76.4555 26.1951 22.0238 78.7836 7.2456 2.4544 18.6271 16.9569 8.7526 21.1917 8.7360 30.8842 53.5322 13.2684 5.1439 118.6530 133.6190 21.6293 99.2124 4.9951 44.5375 83.6682 88.5745 43.0114 38.1742 145.9589 51.7230 34.1750 47.0162 29.1210 46.0302 47.5024 27.9285 23.0841 33.3197 16.7976 42.2862 19.2536 42.1766 30.6500 10.7238 12.8583 30.1120 10.4958 37.4238 1.6278 25.5655 9.5373 13.9425
temp: 298.150 k
press: 1.00000 atm
elementType: 8 7 7 7 6 6 6 6 6 6 6 6 6 6 6 6 6 6 6 6 6 6 6 6 6 6 6 6 1 1 1 1 1 1 1 1 1 1 1 1 1 1 1 1 1 1 1 1 1 1 1 1 1 1 1
symmnumber: 1
zpe: 1202549.4 jmol-1
zpe.correction: 0.458027 hartree
zpe.thermalcorrener: 0.482552 hartree
zpe.thermalcorrenthalpy: 0.483496 hartree
zpe.thermalcorrgfe: 0.403673 hartree
zpe.sumelectzpe: -1168.191073 hartree
zpe.sumelectthermal: -1168.166548 hartree
zpe.sumelectthermalent: -1168.165604 hartree
zpe.sumelectthermalfe: -1168.245427 hartree
dipole: 3.8917 -1.2268 -0.1279
dipole: 4.0825
quadrupole: -184.1868 -149.8131 -168.4084
quadrupole: 5.4008 -1.9917 2.9099
quadrupole: -16.7174 17.6563 -0.9390 5.4008 -1.9917 2.9099
hfenergy: -1168.6491002 hartree
pointgroup: C01 [X(C24H27N3O1)]
dipole: 1.5537328 -0.3972549 -0.088811 debye
polarizability: 385.5664999|13.7204777|360.4685647|-3.6964498|15.9081277|153.519785 unknown
InChI: InChI=1S/C24H27N3O/c1-17-6-3-4-9-23(17)26-12-14-27(15-13-26)24-19-7-5-8-21(19)25-22-11-10-18(28-2)16-20(22)24/h3-4,6,9-11,16H,5,7-8,12-15H2,1-2H3
charge 0 multiplicity 1
55 atoms
O  -2.401605 4.20122 0.05316
N  -0.196389 -0.572496 0.048406
N  2.640129 -0.14716 0.145052
N  -4.511152 -1.017528 -0.02332
C  -1.608161 -0.751295 0.011393
C  -2.24249 -2.002531 -0.086841
C  0.44463 -0.028106 1.268002
C  0.705814 -1.446928 -0.724916
C  -1.670675 -3.415546 -0.096388
C  1.734887 0.734799 0.910966
C  1.981788 -0.661789 -1.084673
C  -2.900079 -4.31542 0.256164
C  -3.680309 -2.066324 -0.116405
C  -4.146363 -3.509904 -0.21153
C  -2.468678 0.425145 0.049207
C  -3.904186 0.233418 0.060565
C  4.023597 0.223954 0.051638
C  -1.94441 1.757467 0.028936
C  -4.754792 1.384836 0.131621
C  5.019756 -0.778806 -0.195852
C  4.433209 1.57239 0.254833
C  -2.809941 2.85733 0.080974
C  -4.227397 2.672255 0.152736
C  6.375796 -0.378154 -0.272341
C  4.665314 -2.251653 -0.304573
C  5.793032 1.941407 0.189391
C  6.774159 0.965442 -0.089967
C  -0.965303 4.465199 -0.035481
H  0.707069 -0.85477 1.967585
H  -0.261283 0.641905 1.785769
H  0.193358 -1.761413 -1.650131
H  1.004868 -2.357172 -0.156842
H  -1.272927 -3.6805 -1.097388
H  -0.842972 -3.550403 0.622454
H  1.460419 1.652582 0.33221
H  2.243918 1.050678 1.838809
H  2.678973 -1.316323 -1.630259
H  1.707309 0.182867 -1.759907
H  -2.834203 -5.313404 -0.210448
H  -2.946307 -4.459047 1.351568
H  -5.046855 -3.692976 0.397942
H  -4.407569 -3.750229 -1.262045
H  -0.864831 1.887111 -0.080578
H  -5.834374 1.209011 0.155035
H  3.681082 2.343862 0.449701
H  -4.866467 3.559141 0.198444
H  7.137942 -1.147103 -0.451551
H  3.776488 -2.482189 0.310002
H  4.440017 -2.5606 -1.344944
H  5.506674 -2.877813 0.040092
H  6.08104 2.987276 0.345977
H  7.832969 1.239997 -0.147259
H  -0.537569 4.055431 -0.971642
H  -0.424321 4.040871 0.833937
H  -0.871727 5.561089 -0.032789
